POV-Ray : Newsgroups : povray.bugreports : Blobs: Error 1: Negative Values: Holes! / Error 2: Alpha Value Overwriting? Server Time
20 Oct 2021 16:14:22 EDT (-0400)
  Blobs: Error 1: Negative Values: Holes! / Error 2: Alpha Value Overwriting? (Message 39 to 48 of 48)  
<<< Previous 10 Messages Goto Initial 10 Messages
From: Sven Littkowski
Subject: Re: Blobs: Error1:NegativeValues:Holes!/Error2:AlphaValueOverwriting?
Date: 12 Jan 2016 12:18:42
Message: <56953572@news.povray.org>
It seems to me, inside the entire POV-Ray Stable Zip there is no
"build.h" file. Can you verify? I would make that change, but can't
without that "build.h" file.

Besides, after I made the changes to "blob.cpp", which file do I have to
load (open) into the MS VS C software to compile my own version?

And how to compile - what menu commonds should I use?

Thanks for the great help, so far. :-)


Post a reply to this message

From: Sven Littkowski
Subject: Re: Blobs: Error1:NegativeValues:Holes!/Error2:AlphaValueOverwriting?
Date: 12 Jan 2016 12:23:29
Message: <56953691@news.povray.org>
I have povray.sln opened.

VS wants to update several POV-Ray files to the latest, newest version
of VS. I permitted this.

The VS does not give me any command like "compile" (as I am used from
Delphi). How to create the EXE file(s)? Thanks.


Post a reply to this message

From: Sven Littkowski
Subject: Re: Blobs: Error1:NegativeValues:Holes!/Error2:AlphaValueOverwriting?
Date: 12 Jan 2016 12:31:10
Message: <5695385e@news.povray.org>
I clicked on "Debug" and it debugged. During that process, many warnings
were generated. And at the end, after an error message and the question
if I wanted to continue to execute the last build, the file could not be
run because something was missing.

Here is the LOG:
----------------------------------------------------------------

1>------ Erstellen gestartet: Projekt: eLut, Konfiguration: Release
Win32 ------
2>------ Erstellen gestartet: Projekt: toFloat, Konfiguration: Release
Win32 ------
2>  toFloat.cpp
1>  eLut.cpp
1>  openexr_eLut.vcxproj -> H:\- Setup\Applications\-
3D\POV-Ray\C++\povray-3.7-stable\windows\vs10\build\eLut\Win32\Release\eLut.exe
1>  openexr_eLut.vcxproj -> build\eLut\Win32\Release\eLut.pdb (Full PDB)
3>------ Erstellen gestartet: Projekt: tiff, Konfiguration: Debug Win32
------
2>  openexr_toFloat.vcxproj -> H:\- Setup\Applications\-
3D\POV-Ray\C++\povray-3.7-stable\windows\vs10\build\toFloat\Win32\Release\toFloat.exe
2>  openexr_toFloat.vcxproj -> build\toFloat\Win32\Release\toFloat.pdb
(Full PDB)
4>------ Erstellen gestartet: Projekt: Half, Konfiguration: Debug Win32
------
4>  half.cpp
4>H:\Program Files (x86)\Microsoft Visual Studio
14.0\VC\include\yvals.h(26): warning C4005: "_HAS_CPP0X":
Makro-Neudefinition
4>  H:\Program Files (x86)\Microsoft Visual Studio
14.0\VC\include\yvals.h(26): note: Befehlszeilenargumente: siehe
vorherige Definition von "_HAS_CPP0X"
3>
3>  Microsoft (R) Program Maintenance Utility, Version 14.00.23506.0
3>  Copyright (C) Microsoft Corporation. Alle Rechte vorbehalten.
3>
3>  	copy ..\..\libraries\tiff\libtiff\tif_config.h.vc
..\..\libraries\tiff\libtiff\tif_config.h
4>..\..\libraries\ilmbase\Half\half.cpp(63): fatal error C1083: Datei
(Include) kann nicht geöffnet werden: "toFloat.h": No such file or directory
5>------ Erstellen gestartet: Projekt: b44ExpLogTable, Konfiguration:
Debug Win32 ------
3>          1 file(s) copied.
3>  	copy ..\..\libraries\tiff\libtiff\tiffconf.h.vc
..\..\libraries\tiff\libtiff\tiffconf.h
3>          1 file(s) copied.
3>  tif_aux.c
3>  tif_close.c
3>  tif_codec.c
5>  b44ExpLogTable.cpp
3>  tif_color.c
5>LINK : fatal error LNK1104: Datei "H:\- Setup\Applications\-
3D\POV-Ray\C++\povray-3.7-stable\windows\vs10\bin32\lib\Half32d.lib"
kann nicht geöffnet werden.
6>------ Erstellen gestartet: Projekt: jpeg, Konfiguration: Debug Win32
------
3>  tif_compress.c
6>  jaricom.c
3>  tif_dir.c
6>  jcapimin.c
6>  jcapistd.c
3>  tif_dirinfo.c
6>  jcarith.c
6>  jccoefct.c
3>..\..\libraries\tiff\libtiff\tif_dirinfo.c(754): warning C4996:
'_lfind': The POSIX name for this item is deprecated. Instead, use the
ISO C and C++ conformant name: _lfind. See online help for details.
3>  C:\Program Files (x86)\Windows
Kits\10\Include\10.0.10240.0\ucrt\corecrt_search.h(71): note: Siehe
Deklaration von "_lfind"
3>  tif_dirread.c
6>  jccolor.c
6>  jcdctmgr.c
6>  jchuff.c
3>  tif_dirwrite.c
6>  jcinit.c
6>  jcmainct.c
3>  tif_dumpmode.c
6>  jcmarker.c
3>  tif_error.c
6>  jcmaster.c
6>  jcomapi.c
6>  jcparam.c
3>  tif_fax3.c
6>  jcprepct.c
6>  jcsample.c
6>  jctrans.c
6>  jdapimin.c
6>  jdapistd.c
3>  tif_fax3sm.c
6>  jdarith.c
6>  Code wird generiert...
3>  tif_flush.c
3>  tif_getimage.c
6>  Kompilieren...
6>  jdatadst.c
6>  jdatasrc.c
3>  tif_jpeg.c
3>..\..\libraries\tiff\libtiff\tif_jpeg.c(27): warning C4005:
"WIN32_LEAN_AND_MEAN": Makro-Neudefinition
3>  ..\..\libraries\tiff\libtiff\tif_jpeg.c(27): note:
Befehlszeilenargumente: siehe vorherige Definition von "WIN32_LEAN_AND_MEAN"
6>  jdcoefct.c
6>  jdcolor.c
3>  tif_luv.c
6>  jddctmgr.c
6>  jdhuff.c
6>  jdinput.c
6>  jdmainct.c
6>  jdmarker.c
3>  tif_lzw.c
6>  jdmaster.c
6>  jdmerge.c
6>  jdpostct.c
3>  tif_next.c
6>  jdsample.c
6>  jdtrans.c
3>  tif_open.c
6>  jerror.c
6>  jfdctflt.c
6>  jfdctfst.c
6>  jfdctint.c
3>  Code wird generiert...
6>  jidctflt.c
6>  jidctfst.c
6>  Code wird generiert...
3>  Kompilieren...
3>  tif_packbits.c
3>  tif_pixarlog.c
6>  Kompilieren...
6>  jidctint.c
6>  jmemmgr.c
3>  tif_predict.c
6>  jmemnobs.c
3>  tif_print.c
6>  jquant1.c
6>  jquant2.c
6>  jutils.c
3>  tif_read.c
6>  Code wird generiert...
3>  tif_strip.c
3>  tif_swab.c
6>  jpeg.vcxproj -> H:\- Setup\Applications\-
3D\POV-Ray\C++\povray-3.7-stable\windows\vs10\bin32\lib\jpeg32d.lib
3>  tif_thunder.c
3>  tif_tile.c
3>  tif_version.c
3>  tif_warning.c
3>  tif_win32.c
3>  tif_write.c
3>  tif_zip.c
7>------ Erstellen gestartet: Projekt: libpng, Konfiguration: Debug
Win32 ------
3>  Code wird generiert...
7>          1 file(s) copied.
7>  png.c
7>  pngerror.c
7>  pngget.c
7>  pngmem.c
7>  pngpread.c
7>  pngread.c
7>  pngrio.c
7>  pngrtran.c
7>  pngrutil.c
7>  pngset.c
7>  pngtrans.c
7>  pngwio.c
7>  pngwrite.c
7>  pngwtran.c
7>  pngwutil.c
7>  Code wird generiert...
3>  tiff.vcxproj -> H:\- Setup\Applications\-
3D\POV-Ray\C++\povray-3.7-stable\windows\vs10\bin32\lib\tiff32d.lib
8>------ Erstellen gestartet: Projekt: zlib, Konfiguration: Debug Win32
------
7>  libpng.vcxproj -> H:\- Setup\Applications\-
3D\POV-Ray\C++\povray-3.7-stable\windows\vs10\bin32\lib\libpng32d.lib
8>  adler32.c
8>  compress.c
8>  crc32.c
8>  deflate.c
8>  gzclose.c
8>  gzlib.c
8>..\..\libraries\zlib\gzlib.c(239): warning C4996: 'open': The POSIX
name for this item is deprecated. Instead, use the ISO C and C++
conformant name: _open. See online help for details.
8>  C:\Program Files (x86)\Windows
Kits\10\Include\10.0.10240.0\ucrt\corecrt_io.h(514): note: Siehe
Deklaration von "open"
8>  gzread.c
8>..\..\libraries\zlib\gzread.c(30): warning C4996: 'read': The POSIX
name for this item is deprecated. Instead, use the ISO C and C++
conformant name: _read. See online help for details.
8>  C:\Program Files (x86)\Windows
Kits\10\Include\10.0.10240.0\ucrt\corecrt_io.h(521): note: Siehe
Deklaration von "read"
8>..\..\libraries\zlib\gzread.c(586): warning C4996: 'close': The POSIX
name for this item is deprecated. Instead, use the ISO C and C++
conformant name: _close. See online help for details.
8>  C:\Program Files (x86)\Windows
Kits\10\Include\10.0.10240.0\ucrt\corecrt_io.h(457): note: Siehe
Deklaration von "close"
8>  gzwrite.c
8>..\..\libraries\zlib\gzwrite.c(84): warning C4996: 'write': The POSIX
name for this item is deprecated. Instead, use the ISO C and C++
conformant name: _write. See online help for details.
8>  C:\Program Files (x86)\Windows
Kits\10\Include\10.0.10240.0\ucrt\corecrt_io.h(556): note: Siehe
Deklaration von "write"
8>..\..\libraries\zlib\gzwrite.c(101): warning C4996: 'write': The POSIX
name for this item is deprecated. Instead, use the ISO C and C++
conformant name: _write. See online help for details.
8>  C:\Program Files (x86)\Windows
Kits\10\Include\10.0.10240.0\ucrt\corecrt_io.h(556): note: Siehe
Deklaration von "write"
8>..\..\libraries\zlib\gzwrite.c(561): warning C4996: 'close': The POSIX
name for this item is deprecated. Instead, use the ISO C and C++
conformant name: _close. See online help for details.
8>  C:\Program Files (x86)\Windows
Kits\10\Include\10.0.10240.0\ucrt\corecrt_io.h(457): note: Siehe
Deklaration von "close"
8>  infback.c
8>  inffast.c
8>  inflate.c
8>  inftrees.c
8>  trees.c
8>  uncompr.c
8>  zutil.c
8>  Code wird generiert...
8>  zlib.vcxproj -> H:\- Setup\Applications\-
3D\POV-Ray\C++\povray-3.7-stable\windows\vs10\bin32\lib\zlib32d.lib
9>------ Erstellen gestartet: Projekt: vfewin, Konfiguration: Debug
Win32 ------
9>  vfeprecomp.cpp
9>H:\Program Files (x86)\Microsoft Visual Studio
14.0\VC\include\yvals.h(26): warning C4005: "_HAS_CPP0X":
Makro-Neudefinition
9>  H:\Program Files (x86)\Microsoft Visual Studio
14.0\VC\include\yvals.h(26): note: Befehlszeilenargumente: siehe
vorherige Definition von "_HAS_CPP0X"
9>  Unknown compiler version - please run the configure tests and report
the results
9>H:\- Setup\Applications\-
3D\POV-Ray\C++\povray-3.7-stable\libraries\boost\boost/thread/xtime.hpp(23):
error C2059: Syntaxfehler: "Konstante"
9>H:\- Setup\Applications\-
3D\POV-Ray\C++\povray-3.7-stable\libraries\boost\boost/thread/xtime.hpp(31):
error C2143: Syntaxfehler: Es fehlt ";" vor "}"
9>H:\- Setup\Applications\-
3D\POV-Ray\C++\povray-3.7-stable\libraries\boost\boost/thread/xtime.hpp(46):
error C2833: Operator "system_time" ist kein bekannter Operator oder Typ
9>H:\- Setup\Applications\-
3D\POV-Ray\C++\povray-3.7-stable\libraries\boost\boost/thread/xtime.hpp(46):
error C2059: Syntaxfehler: "newline"
9>H:\- Setup\Applications\-
3D\POV-Ray\C++\povray-3.7-stable\libraries\boost\boost/thread/xtime.hpp(47):
error C2334: Unerwartete(s) Token vor "{"; sichtbarer Funktionstext wird
übersprungen
9>H:\- Setup\Applications\-
3D\POV-Ray\C++\povray-3.7-stable\libraries\boost\boost/thread/xtime.hpp(73):
error C3861: "get_system_time": Bezeichner wurde nicht gefunden.
9>H:\- Setup\Applications\-
3D\POV-Ray\C++\povray-3.7-stable\libraries\boost\boost/thread/xtime.hpp(88):
error C2059: Syntaxfehler: "}"
9>H:\- Setup\Applications\-
3D\POV-Ray\C++\povray-3.7-stable\libraries\boost\boost/thread/xtime.hpp(88):
error C2143: Syntaxfehler: Es fehlt ";" vor "}"
9>h:\- setup\applications\-
3d\pov-ray\c++\povray-3.7-stable\libraries\boost\boost\thread\win32\basic_timed_mutex.hpp(22):
error C2143: Syntaxfehler: Es fehlt ";" vor "{"
9>h:\- setup\applications\-
3d\pov-ray\c++\povray-3.7-stable\libraries\boost\boost\thread\win32\basic_timed_mutex.hpp(22):
error C2447: "{": Funktionsheader fehlt - Parameterliste im alten Stil?
9>H:\- Setup\Applications\-
3D\POV-Ray\C++\povray-3.7-stable\libraries\boost\boost/thread/win32/mutex.hpp(19):
error C2039: "basic_timed_mutex": Ist kein Element von "boost::detail"
9>  H:\- Setup\Applications\-
3D\POV-Ray\C++\povray-3.7-stable\libraries\boost\boost/thread/win32/mutex.hpp(17):
note: Siehe Deklaration von "boost::detail"
9>H:\- Setup\Applications\-
3D\POV-Ray\C++\povray-3.7-stable\libraries\boost\boost/thread/win32/mutex.hpp(19):
error C4430: Fehlender Typspezifizierer - int wird angenommen. Hinweis:
"default-int" wird von C++ nicht unterstützt.
9>H:\- Setup\Applications\-
3D\POV-Ray\C++\povray-3.7-stable\libraries\boost\boost/thread/win32/mutex.hpp(19):
error C2146: Syntaxfehler: Fehlendes ";" vor Bezeichner "underlying_mutex"
9>H:\- Setup\Applications\-
3D\POV-Ray\C++\povray-3.7-stable\libraries\boost\boost/thread/win32/mutex.hpp(24):
error C2039: "underlying_mutex": Ist kein Element von "boost::detail"
9>  H:\- Setup\Applications\-
3D\POV-Ray\C++\povray-3.7-stable\libraries\boost\boost/thread/win32/mutex.hpp(17):
note: Siehe Deklaration von "boost::detail"
9>H:\- Setup\Applications\-
3D\POV-Ray\C++\povray-3.7-stable\libraries\boost\boost/thread/win32/mutex.hpp(24):
error C2504: "underlying_mutex": Basisklasse undefiniert
9>H:\- Setup\Applications\-
3D\POV-Ray\C++\povray-3.7-stable\libraries\boost\boost/thread/win32/mutex.hpp(31):
error C3861: "initialize": Bezeichner wurde nicht gefunden.
9>H:\- Setup\Applications\-
3D\POV-Ray\C++\povray-3.7-stable\libraries\boost\boost/thread/win32/mutex.hpp(35):
error C3861: "destroy": Bezeichner wurde nicht gefunden.
9>H:\- Setup\Applications\-
3D\POV-Ray\C++\povray-3.7-stable\libraries\boost\boost/thread/win32/mutex.hpp(46):
error C2516: "boost::detail::basic_timed_mutex": Keine zulässige Basisklasse
9>  H:\- Setup\Applications\-
3D\POV-Ray\C++\povray-3.7-stable\libraries\boost\boost/thread/win32/mutex.hpp(19):
note: Siehe Deklaration von "boost::detail::basic_timed_mutex"
9>H:\- Setup\Applications\-
3D\POV-Ray\C++\povray-3.7-stable\libraries\boost\boost/thread/win32/mutex.hpp(53):
error C3861: "initialize": Bezeichner wurde nicht gefunden.
9>H:\- Setup\Applications\-
3D\POV-Ray\C++\povray-3.7-stable\libraries\boost\boost/thread/win32/mutex.hpp(58):
error C3861: "destroy": Bezeichner wurde nicht gefunden.
9>H:\- Setup\Applications\-
3D\POV-Ray\C++\povray-3.7-stable\libraries\boost\boost/thread/detail/thread.hpp(385):
error C2440: "<function-style-cast>": "const boost::xtime" kann nicht in
"boost::system_time" konvertiert werden
9>  H:\- Setup\Applications\-
3D\POV-Ray\C++\povray-3.7-stable\libraries\boost\boost/thread/detail/thread.hpp(385):
note: Quelltyp konnte von keinem Konstruktor angenommen werden, oder die
Überladungsauflösung des Konstruktors ist mehrdeutig
9>H:\- Setup\Applications\-
3D\POV-Ray\C++\povray-3.7-stable\libraries\boost\boost/thread/win32/condition_variable.hpp(327):
error C2440: "<function-style-cast>": "const boost::xtime" kann nicht in
"boost::system_time" konvertiert werden
9>  H:\- Setup\Applications\-
3D\POV-Ray\C++\povray-3.7-stable\libraries\boost\boost/thread/win32/condition_variable.hpp(327):
note: Quelltyp konnte von keinem Konstruktor angenommen werden, oder die
Überladungsauflösung des Konstruktors ist mehrdeutig
9>H:\- Setup\Applications\-
3D\POV-Ray\C++\povray-3.7-stable\libraries\boost\boost/thread/win32/condition_variable.hpp(327):
error C2672: "boost::detail::basic_condition_variable::do_wait": keine
übereinstimmende überladene Funktion gefunden
9>H:\- Setup\Applications\-
3D\POV-Ray\C++\povray-3.7-stable\libraries\boost\boost/thread/win32/condition_variable.hpp(327):
error C2780: "bool
boost::detail::basic_condition_variable::do_wait(lock_type &,const
boost::detail::timeout &,predicate_type)": Erwartet 3 Argumente - 1
unterstützt
9>  H:\- Setup\Applications\-
3D\POV-Ray\C++\povray-3.7-stable\libraries\boost\boost/thread/win32/condition_variable.hpp(229):
note: Siehe Deklaration von
"boost::detail::basic_condition_variable::do_wait"
9>H:\- Setup\Applications\-
3D\POV-Ray\C++\povray-3.7-stable\libraries\boost\boost/thread/win32/condition_variable.hpp(327):
error C2780: "bool
boost::detail::basic_condition_variable::do_wait(lock_type
&,boost::detail::timeout)": Erwartet 2 Argumente - 1 unterstützt
9>  H:\- Setup\Applications\-
3D\POV-Ray\C++\povray-3.7-stable\libraries\boost\boost/thread/win32/condition_variable.hpp(207):
note: Siehe Deklaration von
"boost::detail::basic_condition_variable::do_wait"
10>------ Erstellen gestartet: Projekt: rtrsupport, Konfiguration: Debug
Win32 ------
11>------ Erstellen gestartet: Projekt: povbackend, Konfiguration: Debug
Win32 ------
11>  precomp.cpp
11>H:\Program Files (x86)\Microsoft Visual Studio
14.0\VC\include\yvals.h(26): warning C4005: "_HAS_CPP0X":
Makro-Neudefinition
11>  H:\Program Files (x86)\Microsoft Visual Studio
14.0\VC\include\yvals.h(26): note: Befehlszeilenargumente: siehe
vorherige Definition von "_HAS_CPP0X"
11>  Unknown compiler version - please run the configure tests and
report the results
11>H:\- Setup\Applications\-
3D\POV-Ray\C++\povray-3.7-stable\libraries\boost\boost/thread/xtime.hpp(23):
error C2059: Syntaxfehler: "Konstante"
11>H:\- Setup\Applications\-
3D\POV-Ray\C++\povray-3.7-stable\libraries\boost\boost/thread/xtime.hpp(31):
error C2143: Syntaxfehler: Es fehlt ";" vor "}"
11>H:\- Setup\Applications\-
3D\POV-Ray\C++\povray-3.7-stable\libraries\boost\boost/thread/xtime.hpp(46):
error C2833: Operator "system_time" ist kein bekannter Operator oder Typ
11>H:\- Setup\Applications\-
3D\POV-Ray\C++\povray-3.7-stable\libraries\boost\boost/thread/xtime.hpp(46):
error C2059: Syntaxfehler: "newline"
11>H:\- Setup\Applications\-
3D\POV-Ray\C++\povray-3.7-stable\libraries\boost\boost/thread/xtime.hpp(47):
error C2334: Unerwartete(s) Token vor "{"; sichtbarer Funktionstext wird
übersprungen
11>H:\- Setup\Applications\-
3D\POV-Ray\C++\povray-3.7-stable\libraries\boost\boost/thread/xtime.hpp(73):
error C3861: "get_system_time": Bezeichner wurde nicht gefunden.
11>H:\- Setup\Applications\-
3D\POV-Ray\C++\povray-3.7-stable\libraries\boost\boost/thread/xtime.hpp(88):
error C2059: Syntaxfehler: "}"
11>H:\- Setup\Applications\-
3D\POV-Ray\C++\povray-3.7-stable\libraries\boost\boost/thread/xtime.hpp(88):
error C2143: Syntaxfehler: Es fehlt ";" vor "}"
11>h:\- setup\applications\-
3d\pov-ray\c++\povray-3.7-stable\libraries\boost\boost\thread\win32\basic_timed_mutex.hpp(22):
error C2143: Syntaxfehler: Es fehlt ";" vor "{"
11>h:\- setup\applications\-
3d\pov-ray\c++\povray-3.7-stable\libraries\boost\boost\thread\win32\basic_timed_mutex.hpp(22):
error C2447: "{": Funktionsheader fehlt - Parameterliste im alten Stil?
11>H:\- Setup\Applications\-
3D\POV-Ray\C++\povray-3.7-stable\libraries\boost\boost/thread/win32/mutex.hpp(19):
error C2039: "basic_timed_mutex": Ist kein Element von "boost::detail"
11>  H:\- Setup\Applications\-
3D\POV-Ray\C++\povray-3.7-stable\libraries\boost\boost/thread/win32/mutex.hpp(17):
note: Siehe Deklaration von "boost::detail"
11>H:\- Setup\Applications\-
3D\POV-Ray\C++\povray-3.7-stable\libraries\boost\boost/thread/win32/mutex.hpp(19):
error C4430: Fehlender Typspezifizierer - int wird angenommen. Hinweis:
"default-int" wird von C++ nicht unterstützt.
11>H:\- Setup\Applications\-
3D\POV-Ray\C++\povray-3.7-stable\libraries\boost\boost/thread/win32/mutex.hpp(19):
error C2146: Syntaxfehler: Fehlendes ";" vor Bezeichner "underlying_mutex"
11>H:\- Setup\Applications\-
3D\POV-Ray\C++\povray-3.7-stable\libraries\boost\boost/thread/win32/mutex.hpp(24):
error C2039: "underlying_mutex": Ist kein Element von "boost::detail"
11>  H:\- Setup\Applications\-
3D\POV-Ray\C++\povray-3.7-stable\libraries\boost\boost/thread/win32/mutex.hpp(17):
note: Siehe Deklaration von "boost::detail"
11>H:\- Setup\Applications\-
3D\POV-Ray\C++\povray-3.7-stable\libraries\boost\boost/thread/win32/mutex.hpp(24):
error C2504: "underlying_mutex": Basisklasse undefiniert
11>H:\- Setup\Applications\-
3D\POV-Ray\C++\povray-3.7-stable\libraries\boost\boost/thread/win32/mutex.hpp(31):
error C3861: "initialize": Bezeichner wurde nicht gefunden.
11>H:\- Setup\Applications\-
3D\POV-Ray\C++\povray-3.7-stable\libraries\boost\boost/thread/win32/mutex.hpp(35):
error C3861: "destroy": Bezeichner wurde nicht gefunden.
11>H:\- Setup\Applications\-
3D\POV-Ray\C++\povray-3.7-stable\libraries\boost\boost/thread/win32/mutex.hpp(46):
error C2516: "boost::detail::basic_timed_mutex": Keine zulässige Basisklasse
11>  H:\- Setup\Applications\-
3D\POV-Ray\C++\povray-3.7-stable\libraries\boost\boost/thread/win32/mutex.hpp(19):
note: Siehe Deklaration von "boost::detail::basic_timed_mutex"
11>H:\- Setup\Applications\-
3D\POV-Ray\C++\povray-3.7-stable\libraries\boost\boost/thread/win32/mutex.hpp(53):
error C3861: "initialize": Bezeichner wurde nicht gefunden.
11>H:\- Setup\Applications\-
3D\POV-Ray\C++\povray-3.7-stable\libraries\boost\boost/thread/win32/mutex.hpp(58):
error C3861: "destroy": Bezeichner wurde nicht gefunden.
11>H:\- Setup\Applications\-
3D\POV-Ray\C++\povray-3.7-stable\libraries\boost\boost/thread/detail/thread.hpp(385):
error C2440: "<function-style-cast>": "const boost::xtime" kann nicht in
"boost::system_time" konvertiert werden
11>  H:\- Setup\Applications\-
3D\POV-Ray\C++\povray-3.7-stable\libraries\boost\boost/thread/detail/thread.hpp(385):
note: Quelltyp konnte von keinem Konstruktor angenommen werden, oder die
Überladungsauflösung des Konstruktors ist mehrdeutig
11>H:\- Setup\Applications\-
3D\POV-Ray\C++\povray-3.7-stable\libraries\boost\boost/thread/win32/condition_variable.hpp(327):
error C2440: "<function-style-cast>": "const boost::xtime" kann nicht in
"boost::system_time" konvertiert werden
11>  H:\- Setup\Applications\-
3D\POV-Ray\C++\povray-3.7-stable\libraries\boost\boost/thread/win32/condition_variable.hpp(327):
note: Quelltyp konnte von keinem Konstruktor angenommen werden, oder die
Überladungsauflösung des Konstruktors ist mehrdeutig
11>H:\- Setup\Applications\-
3D\POV-Ray\C++\povray-3.7-stable\libraries\boost\boost/thread/win32/condition_variable.hpp(327):
error C2672: "boost::detail::basic_condition_variable::do_wait": keine
übereinstimmende überladene Funktion gefunden
11>H:\- Setup\Applications\-
3D\POV-Ray\C++\povray-3.7-stable\libraries\boost\boost/thread/win32/condition_variable.hpp(327):
error C2780: "bool
boost::detail::basic_condition_variable::do_wait(lock_type &,const
boost::detail::timeout &,predicate_type)": Erwartet 3 Argumente - 1
unterstützt
11>  H:\- Setup\Applications\-
3D\POV-Ray\C++\povray-3.7-stable\libraries\boost\boost/thread/win32/condition_variable.hpp(229):
note: Siehe Deklaration von
"boost::detail::basic_condition_variable::do_wait"
11>H:\- Setup\Applications\-
3D\POV-Ray\C++\povray-3.7-stable\libraries\boost\boost/thread/win32/condition_variable.hpp(327):
error C2780: "bool
boost::detail::basic_condition_variable::do_wait(lock_type
&,boost::detail::timeout)": Erwartet 2 Argumente - 1 unterstützt
11>  H:\- Setup\Applications\-
3D\POV-Ray\C++\povray-3.7-stable\libraries\boost\boost/thread/win32/condition_variable.hpp(207):
note: Siehe Deklaration von
"boost::detail::basic_condition_variable::do_wait"
10>  vidcapimpl.cpp
10>H:\Program Files (x86)\Microsoft Visual Studio
14.0\VC\include\yvals.h(26): warning C4005: "_HAS_CPP0X":
Makro-Neudefinition
10>  H:\Program Files (x86)\Microsoft Visual Studio
14.0\VC\include\yvals.h(26): note: Befehlszeilenargumente: siehe
vorherige Definition von "_HAS_CPP0X"
10>  Unknown compiler version - please run the configure tests and
report the results
10>h:\- setup\applications\-
3d\pov-ray\c++\povray-3.7-stable\vfe\win\compilers/msvc.h(106): fatal
error C1189: #error:  Please update msvc.h to include this version of MSVC
10>  vidcap.cpp
10>H:\Program Files (x86)\Microsoft Visual Studio
14.0\VC\include\yvals.h(26): warning C4005: "_HAS_CPP0X":
Makro-Neudefinition
10>  H:\Program Files (x86)\Microsoft Visual Studio
14.0\VC\include\yvals.h(26): note: Befehlszeilenargumente: siehe
vorherige Definition von "_HAS_CPP0X"
10>  Unknown compiler version - please run the configure tests and
report the results
10>h:\- setup\applications\-
3d\pov-ray\c++\povray-3.7-stable\vfe\win\compilers/msvc.h(106): fatal
error C1189: #error:  Please update msvc.h to include this version of MSVC
10>  rtrsupport.cpp
12>------ Erstellen gestartet: Projekt: povbase, Konfiguration: Debug
Win32 ------
10>H:\Program Files (x86)\Microsoft Visual Studio
14.0\VC\include\yvals.h(26): warning C4005: "_HAS_CPP0X":
Makro-Neudefinition
10>  H:\Program Files (x86)\Microsoft Visual Studio
14.0\VC\include\yvals.h(26): note: Befehlszeilenargumente: siehe
vorherige Definition von "_HAS_CPP0X"
12>  precomp.cpp
12>H:\Program Files (x86)\Microsoft Visual Studio
14.0\VC\include\yvals.h(26): warning C4005: "_HAS_CPP0X":
Makro-Neudefinition
10>  Unknown compiler version - please run the configure tests and
report the results
12>  H:\Program Files (x86)\Microsoft Visual Studio
14.0\VC\include\yvals.h(26): note: Befehlszeilenargumente: siehe
vorherige Definition von "_HAS_CPP0X"
10>h:\- setup\applications\-
3d\pov-ray\c++\povray-3.7-stable\vfe\win\compilers/msvc.h(106): fatal
error C1189: #error:  Please update msvc.h to include this version of MSVC
10>  Code wird generiert...
13>------ Erstellen gestartet: Projekt: povfrontend, Konfiguration:
Debug Win32 ------
12>  Unknown compiler version - please run the configure tests and
report the results
13>  precomp.cpp
13>H:\Program Files (x86)\Microsoft Visual Studio
14.0\VC\include\yvals.h(26): warning C4005: "_HAS_CPP0X":
Makro-Neudefinition
13>  H:\Program Files (x86)\Microsoft Visual Studio
14.0\VC\include\yvals.h(26): note: Befehlszeilenargumente: siehe
vorherige Definition von "_HAS_CPP0X"
13>  Unknown compiler version - please run the configure tests and
report the results
12>H:\- Setup\Applications\-
3D\POV-Ray\C++\povray-3.7-stable\libraries\boost\boost/thread/xtime.hpp(23):
error C2059: Syntaxfehler: "Konstante"
12>H:\- Setup\Applications\-
3D\POV-Ray\C++\povray-3.7-stable\libraries\boost\boost/thread/xtime.hpp(31):
error C2143: Syntaxfehler: Es fehlt ";" vor "}"
12>H:\- Setup\Applications\-
3D\POV-Ray\C++\povray-3.7-stable\libraries\boost\boost/thread/xtime.hpp(46):
error C2833: Operator "system_time" ist kein bekannter Operator oder Typ
12>H:\- Setup\Applications\-
3D\POV-Ray\C++\povray-3.7-stable\libraries\boost\boost/thread/xtime.hpp(46):
error C2059: Syntaxfehler: "newline"
12>H:\- Setup\Applications\-
3D\POV-Ray\C++\povray-3.7-stable\libraries\boost\boost/thread/xtime.hpp(47):
error C2334: Unerwartete(s) Token vor "{"; sichtbarer Funktionstext wird
übersprungen
12>H:\- Setup\Applications\-
3D\POV-Ray\C++\povray-3.7-stable\libraries\boost\boost/thread/xtime.hpp(73):
error C3861: "get_system_time": Bezeichner wurde nicht gefunden.
12>H:\- Setup\Applications\-
3D\POV-Ray\C++\povray-3.7-stable\libraries\boost\boost/thread/xtime.hpp(88):
error C2059: Syntaxfehler: "}"
12>H:\- Setup\Applications\-
3D\POV-Ray\C++\povray-3.7-stable\libraries\boost\boost/thread/xtime.hpp(88):
error C2143: Syntaxfehler: Es fehlt ";" vor "}"
12>h:\- setup\applications\-
3d\pov-ray\c++\povray-3.7-stable\libraries\boost\boost\thread\win32\basic_timed_mutex.hpp(22):
error C2143: Syntaxfehler: Es fehlt ";" vor "{"
12>h:\- setup\applications\-
3d\pov-ray\c++\povray-3.7-stable\libraries\boost\boost\thread\win32\basic_timed_mutex.hpp(22):
error C2447: "{": Funktionsheader fehlt - Parameterliste im alten Stil?
12>H:\- Setup\Applications\-
3D\POV-Ray\C++\povray-3.7-stable\libraries\boost\boost/thread/win32/mutex.hpp(19):
error C2039: "basic_timed_mutex": Ist kein Element von "boost::detail"
12>  H:\- Setup\Applications\-
3D\POV-Ray\C++\povray-3.7-stable\libraries\boost\boost/thread/win32/mutex.hpp(17):
note: Siehe Deklaration von "boost::detail"
12>H:\- Setup\Applications\-
3D\POV-Ray\C++\povray-3.7-stable\libraries\boost\boost/thread/win32/mutex.hpp(19):
error C4430: Fehlender Typspezifizierer - int wird angenommen. Hinweis:
"default-int" wird von C++ nicht unterstützt.
12>H:\- Setup\Applications\-
3D\POV-Ray\C++\povray-3.7-stable\libraries\boost\boost/thread/win32/mutex.hpp(19):
error C2146: Syntaxfehler: Fehlendes ";" vor Bezeichner "underlying_mutex"
12>H:\- Setup\Applications\-
3D\POV-Ray\C++\povray-3.7-stable\libraries\boost\boost/thread/win32/mutex.hpp(24):
error C2039: "underlying_mutex": Ist kein Element von "boost::detail"
12>  H:\- Setup\Applications\-
3D\POV-Ray\C++\povray-3.7-stable\libraries\boost\boost/thread/win32/mutex.hpp(17):
note: Siehe Deklaration von "boost::detail"
12>H:\- Setup\Applications\-
3D\POV-Ray\C++\povray-3.7-stable\libraries\boost\boost/thread/win32/mutex.hpp(24):
error C2504: "underlying_mutex": Basisklasse undefiniert
12>H:\- Setup\Applications\-
3D\POV-Ray\C++\povray-3.7-stable\libraries\boost\boost/thread/win32/mutex.hpp(31):
error C3861: "initialize": Bezeichner wurde nicht gefunden.
12>H:\- Setup\Applications\-
3D\POV-Ray\C++\povray-3.7-stable\libraries\boost\boost/thread/win32/mutex.hpp(35):
error C3861: "destroy": Bezeichner wurde nicht gefunden.
12>H:\- Setup\Applications\-
3D\POV-Ray\C++\povray-3.7-stable\libraries\boost\boost/thread/win32/mutex.hpp(46):
error C2516: "boost::detail::basic_timed_mutex": Keine zulässige Basisklasse
12>  H:\- Setup\Applications\-
3D\POV-Ray\C++\povray-3.7-stable\libraries\boost\boost/thread/win32/mutex.hpp(19):
note: Siehe Deklaration von "boost::detail::basic_timed_mutex"
12>H:\- Setup\Applications\-
3D\POV-Ray\C++\povray-3.7-stable\libraries\boost\boost/thread/win32/mutex.hpp(53):
error C3861: "initialize": Bezeichner wurde nicht gefunden.
12>H:\- Setup\Applications\-
3D\POV-Ray\C++\povray-3.7-stable\libraries\boost\boost/thread/win32/mutex.hpp(58):
error C3861: "destroy": Bezeichner wurde nicht gefunden.
12>H:\- Setup\Applications\-
3D\POV-Ray\C++\povray-3.7-stable\libraries\boost\boost/thread/detail/thread.hpp(385):
error C2440: "<function-style-cast>": "const boost::xtime" kann nicht in
"boost::system_time" konvertiert werden
12>  H:\- Setup\Applications\-
3D\POV-Ray\C++\povray-3.7-stable\libraries\boost\boost/thread/detail/thread.hpp(385):
note: Quelltyp konnte von keinem Konstruktor angenommen werden, oder die
Überladungsauflösung des Konstruktors ist mehrdeutig
12>H:\- Setup\Applications\-
3D\POV-Ray\C++\povray-3.7-stable\libraries\boost\boost/thread/win32/condition_variable.hpp(327):
error C2440: "<function-style-cast>": "const boost::xtime" kann nicht in
"boost::system_time" konvertiert werden
12>  H:\- Setup\Applications\-
3D\POV-Ray\C++\povray-3.7-stable\libraries\boost\boost/thread/win32/condition_variable.hpp(327):
note: Quelltyp konnte von keinem Konstruktor angenommen werden, oder die
Überladungsauflösung des Konstruktors ist mehrdeutig
12>H:\- Setup\Applications\-
3D\POV-Ray\C++\povray-3.7-stable\libraries\boost\boost/thread/win32/condition_variable.hpp(327):
error C2672: "boost::detail::basic_condition_variable::do_wait": keine
übereinstimmende überladene Funktion gefunden
12>H:\- Setup\Applications\-
3D\POV-Ray\C++\povray-3.7-stable\libraries\boost\boost/thread/win32/condition_variable.hpp(327):
error C2780: "bool
boost::detail::basic_condition_variable::do_wait(lock_type &,const
boost::detail::timeout &,predicate_type)": Erwartet 3 Argumente - 1
unterstützt
12>  H:\- Setup\Applications\-
3D\POV-Ray\C++\povray-3.7-stable\libraries\boost\boost/thread/win32/condition_variable.hpp(229):
note: Siehe Deklaration von
"boost::detail::basic_condition_variable::do_wait"
12>H:\- Setup\Applications\-
3D\POV-Ray\C++\povray-3.7-stable\libraries\boost\boost/thread/win32/condition_variable.hpp(327):
error C2780: "bool
boost::detail::basic_condition_variable::do_wait(lock_type
&,boost::detail::timeout)": Erwartet 2 Argumente - 1 unterstützt
12>  H:\- Setup\Applications\-
3D\POV-Ray\C++\povray-3.7-stable\libraries\boost\boost/thread/win32/condition_variable.hpp(207):
note: Siehe Deklaration von
"boost::detail::basic_condition_variable::do_wait"
13>H:\- Setup\Applications\-
3D\POV-Ray\C++\povray-3.7-stable\libraries\boost\boost/thread/xtime.hpp(23):
error C2059: Syntaxfehler: "Konstante"
13>H:\- Setup\Applications\-
3D\POV-Ray\C++\povray-3.7-stable\libraries\boost\boost/thread/xtime.hpp(31):
error C2143: Syntaxfehler: Es fehlt ";" vor "}"
13>H:\- Setup\Applications\-
3D\POV-Ray\C++\povray-3.7-stable\libraries\boost\boost/thread/xtime.hpp(46):
error C2833: Operator "system_time" ist kein bekannter Operator oder Typ
13>H:\- Setup\Applications\-
3D\POV-Ray\C++\povray-3.7-stable\libraries\boost\boost/thread/xtime.hpp(46):
error C2059: Syntaxfehler: "newline"
13>H:\- Setup\Applications\-
3D\POV-Ray\C++\povray-3.7-stable\libraries\boost\boost/thread/xtime.hpp(47):
error C2334: Unerwartete(s) Token vor "{"; sichtbarer Funktionstext wird
übersprungen
13>H:\- Setup\Applications\-
3D\POV-Ray\C++\povray-3.7-stable\libraries\boost\boost/thread/xtime.hpp(73):
error C3861: "get_system_time": Bezeichner wurde nicht gefunden.
13>H:\- Setup\Applications\-
3D\POV-Ray\C++\povray-3.7-stable\libraries\boost\boost/thread/xtime.hpp(88):
error C2059: Syntaxfehler: "}"
13>H:\- Setup\Applications\-
3D\POV-Ray\C++\povray-3.7-stable\libraries\boost\boost/thread/xtime.hpp(88):
error C2143: Syntaxfehler: Es fehlt ";" vor "}"
13>h:\- setup\applications\-
3d\pov-ray\c++\povray-3.7-stable\libraries\boost\boost\thread\win32\basic_timed_mutex.hpp(22):
error C2143: Syntaxfehler: Es fehlt ";" vor "{"
13>h:\- setup\applications\-
3d\pov-ray\c++\povray-3.7-stable\libraries\boost\boost\thread\win32\basic_timed_mutex.hpp(22):
error C2447: "{": Funktionsheader fehlt - Parameterliste im alten Stil?
13>H:\- Setup\Applications\-
3D\POV-Ray\C++\povray-3.7-stable\libraries\boost\boost/thread/win32/mutex.hpp(19):
error C2039: "basic_timed_mutex": Ist kein Element von "boost::detail"
13>  H:\- Setup\Applications\-
3D\POV-Ray\C++\povray-3.7-stable\libraries\boost\boost/thread/win32/mutex.hpp(17):
note: Siehe Deklaration von "boost::detail"
13>H:\- Setup\Applications\-
3D\POV-Ray\C++\povray-3.7-stable\libraries\boost\boost/thread/win32/mutex.hpp(19):
error C4430: Fehlender Typspezifizierer - int wird angenommen. Hinweis:
"default-int" wird von C++ nicht unterstützt.
13>H:\- Setup\Applications\-
3D\POV-Ray\C++\povray-3.7-stable\libraries\boost\boost/thread/win32/mutex.hpp(19):
error C2146: Syntaxfehler: Fehlendes ";" vor Bezeichner "underlying_mutex"
13>H:\- Setup\Applications\-
3D\POV-Ray\C++\povray-3.7-stable\libraries\boost\boost/thread/win32/mutex.hpp(24):
error C2039: "underlying_mutex": Ist kein Element von "boost::detail"
13>  H:\- Setup\Applications\-
3D\POV-Ray\C++\povray-3.7-stable\libraries\boost\boost/thread/win32/mutex.hpp(17):
note: Siehe Deklaration von "boost::detail"
13>H:\- Setup\Applications\-
3D\POV-Ray\C++\povray-3.7-stable\libraries\boost\boost/thread/win32/mutex.hpp(24):
error C2504: "underlying_mutex": Basisklasse undefiniert
13>H:\- Setup\Applications\-
3D\POV-Ray\C++\povray-3.7-stable\libraries\boost\boost/thread/win32/mutex.hpp(31):
error C3861: "initialize": Bezeichner wurde nicht gefunden.
13>H:\- Setup\Applications\-
3D\POV-Ray\C++\povray-3.7-stable\libraries\boost\boost/thread/win32/mutex.hpp(35):
error C3861: "destroy": Bezeichner wurde nicht gefunden.
13>H:\- Setup\Applications\-
3D\POV-Ray\C++\povray-3.7-stable\libraries\boost\boost/thread/win32/mutex.hpp(46):
error C2516: "boost::detail::basic_timed_mutex": Keine zulässige Basisklasse
13>  H:\- Setup\Applications\-
3D\POV-Ray\C++\povray-3.7-stable\libraries\boost\boost/thread/win32/mutex.hpp(19):
note: Siehe Deklaration von "boost::detail::basic_timed_mutex"
13>H:\- Setup\Applications\-
3D\POV-Ray\C++\povray-3.7-stable\libraries\boost\boost/thread/win32/mutex.hpp(53):
error C3861: "initialize": Bezeichner wurde nicht gefunden.
13>H:\- Setup\Applications\-
3D\POV-Ray\C++\povray-3.7-stable\libraries\boost\boost/thread/win32/mutex.hpp(58):
error C3861: "destroy": Bezeichner wurde nicht gefunden.
13>H:\- Setup\Applications\-
3D\POV-Ray\C++\povray-3.7-stable\libraries\boost\boost/thread/detail/thread.hpp(385):
error C2440: "<function-style-cast>": "const boost::xtime" kann nicht in
"boost::system_time" konvertiert werden
13>  H:\- Setup\Applications\-
3D\POV-Ray\C++\povray-3.7-stable\libraries\boost\boost/thread/detail/thread.hpp(385):
note: Quelltyp konnte von keinem Konstruktor angenommen werden, oder die
Überladungsauflösung des Konstruktors ist mehrdeutig
13>H:\- Setup\Applications\-
3D\POV-Ray\C++\povray-3.7-stable\libraries\boost\boost/thread/win32/condition_variable.hpp(327):
error C2440: "<function-style-cast>": "const boost::xtime" kann nicht in
"boost::system_time" konvertiert werden
13>  H:\- Setup\Applications\-
3D\POV-Ray\C++\povray-3.7-stable\libraries\boost\boost/thread/win32/condition_variable.hpp(327):
note: Quelltyp konnte von keinem Konstruktor angenommen werden, oder die
Überladungsauflösung des Konstruktors ist mehrdeutig
13>H:\- Setup\Applications\-
3D\POV-Ray\C++\povray-3.7-stable\libraries\boost\boost/thread/win32/condition_variable.hpp(327):
error C2672: "boost::detail::basic_condition_variable::do_wait": keine
übereinstimmende überladene Funktion gefunden
13>H:\- Setup\Applications\-
3D\POV-Ray\C++\povray-3.7-stable\libraries\boost\boost/thread/win32/condition_variable.hpp(327):
error C2780: "bool
boost::detail::basic_condition_variable::do_wait(lock_type &,const
boost::detail::timeout &,predicate_type)": Erwartet 3 Argumente - 1
unterstützt
13>  H:\- Setup\Applications\-
3D\POV-Ray\C++\povray-3.7-stable\libraries\boost\boost/thread/win32/condition_variable.hpp(229):
note: Siehe Deklaration von
"boost::detail::basic_condition_variable::do_wait"
13>H:\- Setup\Applications\-
3D\POV-Ray\C++\povray-3.7-stable\libraries\boost\boost/thread/win32/condition_variable.hpp(327):
error C2780: "bool
boost::detail::basic_condition_variable::do_wait(lock_type
&,boost::detail::timeout)": Erwartet 2 Argumente - 1 unterstützt
13>  H:\- Setup\Applications\-
3D\POV-Ray\C++\povray-3.7-stable\libraries\boost\boost/thread/win32/condition_variable.hpp(207):
note: Siehe Deklaration von
"boost::detail::basic_condition_variable::do_wait"
14>------ Erstellen gestartet: Projekt: boost_thread, Konfiguration:
Debug Win32 ------
15>------ Erstellen gestartet: Projekt: boost_date_time, Konfiguration:
Debug Win32 ------
15>  greg_weekday.cpp
14>  tss_pe.cpp
14>  Unknown compiler version - please run the configure tests and
report the results
15>  Unknown compiler version - please run the configure tests and
report the results
14>..\..\libraries\boost\libs\thread\src\win32\tss_pe.cpp(79): warning
C4005: "WIN32_LEAN_AND_MEAN": Makro-Neudefinition
14>  ..\..\libraries\boost\libs\thread\src\win32\tss_pe.cpp(79): note:
Befehlszeilenargumente: siehe vorherige Definition von "WIN32_LEAN_AND_MEAN"
14>  tss_dll.cpp
14>  Unknown compiler version - please run the configure tests and
report the results
15>  greg_month.cpp
14>  thread.cpp
14>  Unknown compiler version - please run the configure tests and
report the results
15>  Unknown compiler version - please run the configure tests and
report the results
14>H:\- Setup\Applications\-
3D\POV-Ray\C++\povray-3.7-stable\libraries\boost\boost/thread/xtime.hpp(23):
error C2059: Syntaxfehler: "Konstante"
14>H:\- Setup\Applications\-
3D\POV-Ray\C++\povray-3.7-stable\libraries\boost\boost/thread/xtime.hpp(31):
error C2143: Syntaxfehler: Es fehlt ";" vor "}"
14>H:\- Setup\Applications\-
3D\POV-Ray\C++\povray-3.7-stable\libraries\boost\boost/thread/xtime.hpp(46):
error C2833: Operator "system_time" ist kein bekannter Operator oder Typ
14>H:\- Setup\Applications\-
3D\POV-Ray\C++\povray-3.7-stable\libraries\boost\boost/thread/xtime.hpp(46):
error C2059: Syntaxfehler: "newline"
14>H:\- Setup\Applications\-
3D\POV-Ray\C++\povray-3.7-stable\libraries\boost\boost/thread/xtime.hpp(47):
error C2334: Unerwartete(s) Token vor "{"; sichtbarer Funktionstext wird
übersprungen
14>H:\- Setup\Applications\-
3D\POV-Ray\C++\povray-3.7-stable\libraries\boost\boost/thread/xtime.hpp(73):
error C3861: "get_system_time": Bezeichner wurde nicht gefunden.
14>H:\- Setup\Applications\-
3D\POV-Ray\C++\povray-3.7-stable\libraries\boost\boost/thread/xtime.hpp(88):
error C2059: Syntaxfehler: "}"
14>H:\- Setup\Applications\-
3D\POV-Ray\C++\povray-3.7-stable\libraries\boost\boost/thread/xtime.hpp(88):
error C2143: Syntaxfehler: Es fehlt ";" vor "}"
14>h:\- setup\applications\-
3d\pov-ray\c++\povray-3.7-stable\libraries\boost\boost\thread\win32\basic_timed_mutex.hpp(22):
error C2143: Syntaxfehler: Es fehlt ";" vor "{"
14>h:\- setup\applications\-
3d\pov-ray\c++\povray-3.7-stable\libraries\boost\boost\thread\win32\basic_timed_mutex.hpp(22):
error C2447: "{": Funktionsheader fehlt - Parameterliste im alten Stil?
14>H:\- Setup\Applications\-
3D\POV-Ray\C++\povray-3.7-stable\libraries\boost\boost/thread/win32/mutex.hpp(19):
error C2039: "basic_timed_mutex": Ist kein Element von "boost::detail"
14>  H:\- Setup\Applications\-
3D\POV-Ray\C++\povray-3.7-stable\libraries\boost\boost/thread/win32/mutex.hpp(17):
note: Siehe Deklaration von "boost::detail"
14>H:\- Setup\Applications\-
3D\POV-Ray\C++\povray-3.7-stable\libraries\boost\boost/thread/win32/mutex.hpp(19):
error C4430: Fehlender Typspezifizierer - int wird angenommen. Hinweis:
"default-int" wird von C++ nicht unterstützt.
14>H:\- Setup\Applications\-
3D\POV-Ray\C++\povray-3.7-stable\libraries\boost\boost/thread/win32/mutex.hpp(19):
error C2146: Syntaxfehler: Fehlendes ";" vor Bezeichner "underlying_mutex"
14>H:\- Setup\Applications\-
3D\POV-Ray\C++\povray-3.7-stable\libraries\boost\boost/thread/win32/mutex.hpp(24):
error C2039: "underlying_mutex": Ist kein Element von "boost::detail"
14>  H:\- Setup\Applications\-
3D\POV-Ray\C++\povray-3.7-stable\libraries\boost\boost/thread/win32/mutex.hpp(17):
note: Siehe Deklaration von "boost::detail"
14>H:\- Setup\Applications\-
3D\POV-Ray\C++\povray-3.7-stable\libraries\boost\boost/thread/win32/mutex.hpp(24):
error C2504: "underlying_mutex": Basisklasse undefiniert
15>..\..\libraries\boost\libs\date_time\src\gregorian\greg_month.cpp(51): error
C2280:
"boost::shared_ptr<boost::gregorian::greg_month::month_map_type>::shared_ptr(const
boost::shared_ptr<boost::gregorian::greg_month::month_map_type> &)" : Es
wurde versucht, auf eine gelöschte Funktion zu verweisen
14>H:\- Setup\Applications\-
3D\POV-Ray\C++\povray-3.7-stable\libraries\boost\boost/thread/win32/mutex.hpp(31):
error C3861: "initialize": Bezeichner wurde nicht gefunden.
15>  H:\- Setup\Applications\-
3D\POV-Ray\C++\povray-3.7-stable\libraries\boost\boost/smart_ptr/shared_ptr.hpp(477):
note: Compiler hat hier
"boost::shared_ptr<boost::gregorian::greg_month::month_map_type>::shared_ptr"
generiert
14>H:\- Setup\Applications\-
3D\POV-Ray\C++\povray-3.7-stable\libraries\boost\boost/thread/win32/mutex.hpp(35):
error C3861: "destroy": Bezeichner wurde nicht gefunden.
14>H:\- Setup\Applications\-
3D\POV-Ray\C++\povray-3.7-stable\libraries\boost\boost/thread/win32/mutex.hpp(46):
error C2516: "boost::detail::basic_timed_mutex": Keine zulässige Basisklasse
14>  H:\- Setup\Applications\-
3D\POV-Ray\C++\povray-3.7-stable\libraries\boost\boost/thread/win32/mutex.hpp(19):
note: Siehe Deklaration von "boost::detail::basic_timed_mutex"
14>H:\- Setup\Applications\-
3D\POV-Ray\C++\povray-3.7-stable\libraries\boost\boost/thread/win32/mutex.hpp(53):
error C3861: "initialize": Bezeichner wurde nicht gefunden.
14>H:\- Setup\Applications\-
3D\POV-Ray\C++\povray-3.7-stable\libraries\boost\boost/thread/win32/mutex.hpp(58):
error C3861: "destroy": Bezeichner wurde nicht gefunden.
14>H:\- Setup\Applications\-
3D\POV-Ray\C++\povray-3.7-stable\libraries\boost\boost/thread/detail/thread.hpp(385):
error C2440: "<function-style-cast>": "const boost::xtime" kann nicht in
"boost::system_time" konvertiert werden
14>  H:\- Setup\Applications\-
3D\POV-Ray\C++\povray-3.7-stable\libraries\boost\boost/thread/detail/thread.hpp(385):
note: Quelltyp konnte von keinem Konstruktor angenommen werden, oder die
Überladungsauflösung des Konstruktors ist mehrdeutig
15>  date_generators.cpp
14>  Code wird generiert...
16>------ Erstellen gestartet: Projekt: IlmImf, Konfiguration: Debug
Win32 ------
15>  Unknown compiler version - please run the configure tests and
report the results
15>  Code wird generiert...
16>  ImfZipCompressor.cpp
16>H:\Program Files (x86)\Microsoft Visual Studio
14.0\VC\include\yvals.h(26): warning C4005: "_HAS_CPP0X":
Makro-Neudefinition
16>  H:\Program Files (x86)\Microsoft Visual Studio
14.0\VC\include\yvals.h(26): note: Befehlszeilenargumente: siehe
vorherige Definition von "_HAS_CPP0X"
17>------ Erstellen gestartet: Projekt: Iex, Konfiguration: Debug Win32
------
17>  IexThrowErrnoExc.cpp
17>H:\Program Files (x86)\Microsoft Visual Studio
14.0\VC\include\yvals.h(26): warning C4005: "_HAS_CPP0X":
Makro-Neudefinition
17>  H:\Program Files (x86)\Microsoft Visual Studio
14.0\VC\include\yvals.h(26): note: Befehlszeilenargumente: siehe
vorherige Definition von "_HAS_CPP0X"
16>  ImfWav.cpp
16>  ImfVersion.cpp
16>  ImfVecAttribute.cpp
16>H:\Program Files (x86)\Microsoft Visual Studio
14.0\VC\include\yvals.h(26): warning C4005: "_HAS_CPP0X":
Makro-Neudefinition
16>  H:\Program Files (x86)\Microsoft Visual Studio
14.0\VC\include\yvals.h(26): note: Befehlszeilenargumente: siehe
vorherige Definition von "_HAS_CPP0X"
17>..\..\libraries\ilmbase\Iex\IexThrowErrnoExc.cpp(54): warning C4996:
'strerror': This function or variable may be unsafe. Consider using
strerror_s instead. To disable deprecation, use _CRT_SECURE_NO_WARNINGS.
See online help for details.
17>  C:\Program Files (x86)\Windows
Kits\10\Include\10.0.10240.0\ucrt\string.h(178): note: Siehe Deklaration
von "strerror"
16>  ImfTimeCodeAttribute.cpp
17>  IexBaseExc.cpp
17>H:\Program Files (x86)\Microsoft Visual Studio
14.0\VC\include\yvals.h(26): warning C4005: "_HAS_CPP0X":
Makro-Neudefinition
17>  H:\Program Files (x86)\Microsoft Visual Studio
14.0\VC\include\yvals.h(26): note: Befehlszeilenargumente: siehe
vorherige Definition von "_HAS_CPP0X"
16>H:\Program Files (x86)\Microsoft Visual Studio
14.0\VC\include\yvals.h(26): warning C4005: "_HAS_CPP0X":
Makro-Neudefinition
16>  H:\Program Files (x86)\Microsoft Visual Studio
14.0\VC\include\yvals.h(26): note: Befehlszeilenargumente: siehe
vorherige Definition von "_HAS_CPP0X"
16>  ImfTimeCode.cpp
17>  Code wird generiert...
16>H:\Program Files (x86)\Microsoft Visual Studio
14.0\VC\include\yvals.h(26): warning C4005: "_HAS_CPP0X":
Makro-Neudefinition
16>  H:\Program Files (x86)\Microsoft Visual Studio
14.0\VC\include\yvals.h(26): note: Befehlszeilenargumente: siehe
vorherige Definition von "_HAS_CPP0X"
17>  openexr_Iex.vcxproj -> H:\- Setup\Applications\-
3D\POV-Ray\C++\povray-3.7-stable\windows\vs10\bin32\lib\Iex32d.lib
16>..\..\libraries\openexr\IlmImf\ImfTimeCode.cpp(236): warning C4800:
"unsigned int": Variable wird auf booleschen Wert ("True" oder "False")
gesetzt (Auswirkungen auf Leistungsverhalten möglich)
16>..\..\libraries\openexr\IlmImf\ImfTimeCode.cpp(250): warning C4800:
"unsigned int": Variable wird auf booleschen Wert ("True" oder "False")
gesetzt (Auswirkungen auf Leistungsverhalten möglich)
16>..\..\libraries\openexr\IlmImf\ImfTimeCode.cpp(264): warning C4800:
"unsigned int": Variable wird auf booleschen Wert ("True" oder "False")
gesetzt (Auswirkungen auf Leistungsverhalten möglich)
16>..\..\libraries\openexr\IlmImf\ImfTimeCode.cpp(278): warning C4800:
"unsigned int": Variable wird auf booleschen Wert ("True" oder "False")
gesetzt (Auswirkungen auf Leistungsverhalten möglich)
16>..\..\libraries\openexr\IlmImf\ImfTimeCode.cpp(292): warning C4800:
"unsigned int": Variable wird auf booleschen Wert ("True" oder "False")
gesetzt (Auswirkungen auf Leistungsverhalten möglich)
16>..\..\libraries\openexr\IlmImf\ImfTimeCode.cpp(306): warning C4800:
"unsigned int": Variable wird auf booleschen Wert ("True" oder "False")
gesetzt (Auswirkungen auf Leistungsverhalten möglich)
18>------ Erstellen gestartet: Projekt: IlmThread, Konfiguration: Debug
Win32 ------
18>  IlmThreadWin32.cpp
18>H:\Program Files (x86)\Microsoft Visual Studio
14.0\VC\include\yvals.h(26): warning C4005: "_HAS_CPP0X":
Makro-Neudefinition
18>  H:\Program Files (x86)\Microsoft Visual Studio
14.0\VC\include\yvals.h(26): note: Befehlszeilenargumente: siehe
vorherige Definition von "_HAS_CPP0X"
18>..\..\libraries\ilmbase\IlmThread\IlmThreadWin32.cpp(79): warning
C4800: "BOOL": Variable wird auf booleschen Wert ("True" oder "False")
gesetzt (Auswirkungen auf Leistungsverhalten möglich)
16>  ImfTileOffsets.cpp
16>H:\Program Files (x86)\Microsoft Visual Studio
14.0\VC\include\yvals.h(26): warning C4005: "_HAS_CPP0X":
Makro-Neudefinition
16>  H:\Program Files (x86)\Microsoft Visual Studio
14.0\VC\include\yvals.h(26): note: Befehlszeilenargumente: siehe
vorherige Definition von "_HAS_CPP0X"
18>  IlmThreadSemaphoreWin32.cpp
18>H:\Program Files (x86)\Microsoft Visual Studio
14.0\VC\include\yvals.h(26): warning C4005: "_HAS_CPP0X":
Makro-Neudefinition
18>  H:\Program Files (x86)\Microsoft Visual Studio
14.0\VC\include\yvals.h(26): note: Befehlszeilenargumente: siehe
vorherige Definition von "_HAS_CPP0X"
16>..\..\libraries\openexr\IlmImf\ImfTileOffsets.cpp(80): warning C4018:
"<": Konflikt zwischen "signed" und "unsigned"
16>..\..\libraries\openexr\IlmImf\ImfTileOffsets.cpp(82): warning C4018:
"<": Konflikt zwischen "signed" und "unsigned"
16>..\..\libraries\openexr\IlmImf\ImfTileOffsets.cpp(262): warning
C4018: ">": Konflikt zwischen "signed" und "unsigned"
16>..\..\libraries\openexr\IlmImf\ImfTileOffsets.cpp(263): warning
C4018: ">": Konflikt zwischen "signed" und "unsigned"
16>..\..\libraries\openexr\IlmImf\ImfTileOffsets.cpp(274): warning
C4018: ">": Konflikt zwischen "signed" und "unsigned"
16>..\..\libraries\openexr\IlmImf\ImfTileOffsets.cpp(275): warning
C4018: ">": Konflikt zwischen "signed" und "unsigned"
16>..\..\libraries\openexr\IlmImf\ImfTileOffsets.cpp(276): warning
C4018: ">": Konflikt zwischen "signed" und "unsigned"
16>..\..\libraries\openexr\IlmImf\ImfTileOffsets.cpp(287): warning
C4018: ">": Konflikt zwischen "signed" und "unsigned"
16>..\..\libraries\openexr\IlmImf\ImfTileOffsets.cpp(288): warning
C4018: ">": Konflikt zwischen "signed" und "unsigned"
16>..\..\libraries\openexr\IlmImf\ImfTileOffsets.cpp(289): warning
C4018: ">": Konflikt zwischen "signed" und "unsigned"
18>..\..\libraries\ilmbase\IlmThread\IlmThreadSemaphoreWin32.cpp(98):
warning C4800: "BOOL": Variable wird auf booleschen Wert ("True" oder
"False") gesetzt (Auswirkungen auf Leistungsverhalten möglich)
16>  ImfTiledRgbaFile.cpp
16>H:\- Setup\Applications\-
3D\POV-Ray\C++\povray-3.7-stable\libraries\openexr\IlmImf\ImfName.h(103): warning
C4996: 'strncpy': This function or variable may be unsafe. Consider
using strncpy_s instead. To disable deprecation, use
_CRT_SECURE_NO_WARNINGS. See online help for details.
16>  C:\Program Files (x86)\Windows
Kits\10\Include\10.0.10240.0\ucrt\string.h(346): note: Siehe Deklaration
von "strncpy"
16>H:\Program Files (x86)\Microsoft Visual Studio
14.0\VC\include\yvals.h(26): warning C4005: "_HAS_CPP0X":
Makro-Neudefinition
16>  H:\Program Files (x86)\Microsoft Visual Studio
14.0\VC\include\yvals.h(26): note: Befehlszeilenargumente: siehe
vorherige Definition von "_HAS_CPP0X"
18>  IlmThreadSemaphorePosixCompat.cpp
18>  IlmThreadSemaphorePosix.cpp
18>  IlmThreadSemaphore.cpp
18>  IlmThreadPosix.cpp
18>  IlmThreadPool.cpp
18>H:\Program Files (x86)\Microsoft Visual Studio
14.0\VC\include\yvals.h(26): warning C4005: "_HAS_CPP0X":
Makro-Neudefinition
18>  H:\Program Files (x86)\Microsoft Visual Studio
14.0\VC\include\yvals.h(26): note: Befehlszeilenargumente: siehe
vorherige Definition von "_HAS_CPP0X"
18>..\..\libraries\ilmbase\IlmThread\IlmThreadPool.cpp(250): warning
C4018: "<": Konflikt zwischen "signed" und "unsigned"
18>..\..\libraries\ilmbase\IlmThread\IlmThreadPool.cpp(367): warning
C4018: ">": Konflikt zwischen "signed" und "unsigned"
18>..\..\libraries\ilmbase\IlmThread\IlmThreadPool.cpp(373): warning
C4018: "<": Konflikt zwischen "signed" und "unsigned"
18>..\..\libraries\ilmbase\IlmThread\IlmThreadPool.cpp(379): warning
C4018: "<": Konflikt zwischen "signed" und "unsigned"
18>..\..\libraries\ilmbase\IlmThread\IlmThreadPool.cpp(392): warning
C4018: "<": Konflikt zwischen "signed" und "unsigned"
18>  IlmThreadMutexWin32.cpp
16>  ImfTiledOutputFile.cpp
16>H:\- Setup\Applications\-
3D\POV-Ray\C++\povray-3.7-stable\libraries\openexr\IlmImf\ImfName.h(103): warning
C4996: 'strncpy': This function or variable may be unsafe. Consider
using strncpy_s instead. To disable deprecation, use
_CRT_SECURE_NO_WARNINGS. See online help for details.
16>  C:\Program Files (x86)\Windows
Kits\10\Include\10.0.10240.0\ucrt\string.h(346): note: Siehe Deklaration
von "strncpy"
16>H:\Program Files (x86)\Microsoft Visual Studio
14.0\VC\include\yvals.h(26): warning C4005: "_HAS_CPP0X":
Makro-Neudefinition
16>  H:\Program Files (x86)\Microsoft Visual Studio
14.0\VC\include\yvals.h(26): note: Befehlszeilenargumente: siehe
vorherige Definition von "_HAS_CPP0X"
18>H:\Program Files (x86)\Microsoft Visual Studio
14.0\VC\include\yvals.h(26): warning C4005: "_HAS_CPP0X":
Makro-Neudefinition
18>  H:\Program Files (x86)\Microsoft Visual Studio
14.0\VC\include\yvals.h(26): note: Befehlszeilenargumente: siehe
vorherige Definition von "_HAS_CPP0X"
18>  IlmThreadMutexPosix.cpp
18>  IlmThreadMutex.cpp
16>..\..\libraries\openexr\IlmImf\ImfTiledOutputFile.cpp(76): error
C2039: "min": Ist kein Element von "std"
16>  H:\Program Files (x86)\Microsoft Visual Studio
14.0\VC\include\vector(17): note: Siehe Deklaration von "std"
18>  IlmThread.cpp
16>..\..\libraries\openexr\IlmImf\ImfTiledOutputFile.cpp(76): error
C2873: "min": Das Symbol kann nicht in einer using-Deklaration verwendet
werden
16>..\..\libraries\openexr\IlmImf\ImfTiledOutputFile.cpp(77): error
C2039: "max": Ist kein Element von "std"
16>  H:\Program Files (x86)\Microsoft Visual Studio
14.0\VC\include\vector(17): note: Siehe Deklaration von "std"
16>..\..\libraries\openexr\IlmImf\ImfTiledOutputFile.cpp(77): error
C2873: "max": Das Symbol kann nicht in einer using-Deklaration verwendet
werden
16>..\..\libraries\openexr\IlmImf\ImfTiledOutputFile.cpp(295): error
C3861: "max": Bezeichner wurde nicht gefunden.
16>..\..\libraries\openexr\IlmImf\ImfTiledOutputFile.cpp(1137): error
C3861: "min": Bezeichner wurde nicht gefunden.
16>..\..\libraries\openexr\IlmImf\ImfTiledOutputFile.cpp(1267): warning
C4018: "<": Konflikt zwischen "signed" und "unsigned"
16>..\..\libraries\openexr\IlmImf\ImfTiledOutputFile.cpp(1383): warning
C4018: "<": Konflikt zwischen "signed" und "unsigned"
16>..\..\libraries\openexr\IlmImf\ImfTiledOutputFile.cpp(1390): warning
C4018: "<": Konflikt zwischen "signed" und "unsigned"
16>..\..\libraries\openexr\IlmImf\ImfTiledOutputFile.cpp(1391): warning
C4018: "<": Konflikt zwischen "signed" und "unsigned"
18>  Code wird generiert...
16>  ImfTiledMisc.cpp
16>H:\Program Files (x86)\Microsoft Visual Studio
14.0\VC\include\yvals.h(26): warning C4005: "_HAS_CPP0X":
Makro-Neudefinition
16>  H:\Program Files (x86)\Microsoft Visual Studio
14.0\VC\include\yvals.h(26): note: Befehlszeilenargumente: siehe
vorherige Definition von "_HAS_CPP0X"
18>  openexr_IlmThread.vcxproj -> H:\- Setup\Applications\-
3D\POV-Ray\C++\povray-3.7-stable\windows\vs10\bin32\lib\IlmThread32d.lib
16>H:\- Setup\Applications\-
3D\POV-Ray\C++\povray-3.7-stable\libraries\openexr\IlmImf\ImfName.h(103): warning
C4996: 'strncpy': This function or variable may be unsafe. Consider
using strncpy_s instead. To disable deprecation, use
_CRT_SECURE_NO_WARNINGS. See online help for details.
16>  C:\Program Files (x86)\Windows
Kits\10\Include\10.0.10240.0\ucrt\string.h(346): note: Siehe Deklaration
von "strncpy"
16>..\..\libraries\openexr\IlmImf\ImfTiledMisc.cpp(67): error C2039:
"max": Ist kein Element von "std"
16>  H:\Program Files (x86)\Microsoft Visual Studio
14.0\VC\include\set(12): note: Siehe Deklaration von "std"
16>..\..\libraries\openexr\IlmImf\ImfTiledMisc.cpp(67): error C2064:
Ausdruck ergibt keine Funktion, die 2 Argumente übernimmt
16>..\..\libraries\openexr\IlmImf\ImfTiledMisc.cpp(102): error C2039:
"min": Ist kein Element von "std"
16>  H:\Program Files (x86)\Microsoft Visual Studio
14.0\VC\include\set(12): note: Siehe Deklaration von "std"
16>..\..\libraries\openexr\IlmImf\ImfTiledMisc.cpp(102): error C3861:
"min": Bezeichner wurde nicht gefunden.
16>..\..\libraries\openexr\IlmImf\ImfTiledMisc.cpp(103): error C2039:
"min": Ist kein Element von "std"
16>  H:\Program Files (x86)\Microsoft Visual Studio
14.0\VC\include\set(12): note: Siehe Deklaration von "std"
16>..\..\libraries\openexr\IlmImf\ImfTiledMisc.cpp(103): error C3861:
"min": Bezeichner wurde nicht gefunden.
16>..\..\libraries\openexr\IlmImf\ImfTiledMisc.cpp(197): error C2039:
"max": Ist kein Element von "std"
16>  H:\Program Files (x86)\Microsoft Visual Studio
14.0\VC\include\set(12): note: Siehe Deklaration von "std"
16>..\..\libraries\openexr\IlmImf\ImfTiledMisc.cpp(197): error C3861:
"max": Bezeichner wurde nicht gefunden.
16>..\..\libraries\openexr\IlmImf\ImfTiledMisc.cpp(237): error C2039:
"max": Ist kein Element von "std"
16>  H:\Program Files (x86)\Microsoft Visual Studio
14.0\VC\include\set(12): note: Siehe Deklaration von "std"
16>..\..\libraries\openexr\IlmImf\ImfTiledMisc.cpp(237): error C3861:
"max": Bezeichner wurde nicht gefunden.
16>  ImfTiledInputFile.cpp
16>H:\- Setup\Applications\-
3D\POV-Ray\C++\povray-3.7-stable\libraries\openexr\IlmImf\ImfName.h(103): warning
C4996: 'strncpy': This function or variable may be unsafe. Consider
using strncpy_s instead. To disable deprecation, use
_CRT_SECURE_NO_WARNINGS. See online help for details.
16>  C:\Program Files (x86)\Windows
Kits\10\Include\10.0.10240.0\ucrt\string.h(346): note: Siehe Deklaration
von "strncpy"
16>H:\Program Files (x86)\Microsoft Visual Studio
14.0\VC\include\yvals.h(26): warning C4005: "_HAS_CPP0X":
Makro-Neudefinition
16>  H:\Program Files (x86)\Microsoft Visual Studio
14.0\VC\include\yvals.h(26): note: Befehlszeilenargumente: siehe
vorherige Definition von "_HAS_CPP0X"
16>..\..\libraries\openexr\IlmImf\ImfTiledInputFile.cpp(1029): warning
C4018: "<": Konflikt zwischen "signed" und "unsigned"
16>  ImfTileDescriptionAttribute.cpp
16>H:\Program Files (x86)\Microsoft Visual Studio
14.0\VC\include\yvals.h(26): warning C4005: "_HAS_CPP0X":
Makro-Neudefinition
16>  H:\Program Files (x86)\Microsoft Visual Studio
14.0\VC\include\yvals.h(26): note: Befehlszeilenargumente: siehe
vorherige Definition von "_HAS_CPP0X"
16>  ImfThreading.cpp
16>  ImfTestFile.cpp
16>H:\Program Files (x86)\Microsoft Visual Studio
14.0\VC\include\yvals.h(26): warning C4005: "_HAS_CPP0X":
Makro-Neudefinition
16>  H:\Program Files (x86)\Microsoft Visual Studio
14.0\VC\include\yvals.h(26): note: Befehlszeilenargumente: siehe
vorherige Definition von "_HAS_CPP0X"
16>  ImfStringAttribute.cpp
16>H:\Program Files (x86)\Microsoft Visual Studio
14.0\VC\include\yvals.h(26): warning C4005: "_HAS_CPP0X":
Makro-Neudefinition
16>  H:\Program Files (x86)\Microsoft Visual Studio
14.0\VC\include\yvals.h(26): note: Befehlszeilenargumente: siehe
vorherige Definition von "_HAS_CPP0X"
19>------ Erstellen gestartet: Projekt: cmedit, Konfiguration: Debug
Win32 ------
16>  ImfStdIO.cpp
19>  StdStringList.cpp
16>H:\Program Files (x86)\Microsoft Visual Studio
14.0\VC\include\yvals.h(26): warning C4005: "_HAS_CPP0X":
Makro-Neudefinition
16>  H:\Program Files (x86)\Microsoft Visual Studio
14.0\VC\include\yvals.h(26): note: Befehlszeilenargumente: siehe
vorherige Definition von "_HAS_CPP0X"
16>  ImfStandardAttributes.cpp
16>H:\- Setup\Applications\-
3D\POV-Ray\C++\povray-3.7-stable\libraries\openexr\IlmImf\ImfName.h(103): warning
C4996: 'strncpy': This function or variable may be unsafe. Consider
using strncpy_s instead. To disable deprecation, use
_CRT_SECURE_NO_WARNINGS. See online help for details.
16>  C:\Program Files (x86)\Windows
Kits\10\Include\10.0.10240.0\ucrt\string.h(346): note: Siehe Deklaration
von "strncpy"
16>H:\Program Files (x86)\Microsoft Visual Studio
14.0\VC\include\yvals.h(26): warning C4005: "_HAS_CPP0X":
Makro-Neudefinition
16>  H:\Program Files (x86)\Microsoft Visual Studio
14.0\VC\include\yvals.h(26): note: Befehlszeilenargumente: siehe
vorherige Definition von "_HAS_CPP0X"
19>H:\Program Files (x86)\Microsoft Visual Studio
14.0\VC\include\yvals.h(26): warning C4005: "_HAS_CPP0X":
Makro-Neudefinition
19>  H:\Program Files (x86)\Microsoft Visual Studio
14.0\VC\include\yvals.h(26): note: Befehlszeilenargumente: siehe
vorherige Definition von "_HAS_CPP0X"
16>  ImfScanLineInputFile.cpp
16>H:\- Setup\Applications\-
3D\POV-Ray\C++\povray-3.7-stable\libraries\openexr\IlmImf\ImfName.h(103): warning
C4996: 'strncpy': This function or variable may be unsafe. Consider
using strncpy_s instead. To disable deprecation, use
_CRT_SECURE_NO_WARNINGS. See online help for details.
16>  C:\Program Files (x86)\Windows
Kits\10\Include\10.0.10240.0\ucrt\string.h(346): note: Siehe Deklaration
von "strncpy"
16>H:\Program Files (x86)\Microsoft Visual Studio
14.0\VC\include\yvals.h(26): warning C4005: "_HAS_CPP0X":
Makro-Neudefinition
16>  H:\Program Files (x86)\Microsoft Visual Studio
14.0\VC\include\yvals.h(26): note: Befehlszeilenargumente: siehe
vorherige Definition von "_HAS_CPP0X"
19>  settings.cpp
16>..\..\libraries\openexr\IlmImf\ImfScanLineInputFile.cpp(69): error
C2039: "min": Ist kein Element von "std"
16>  H:\Program Files (x86)\Microsoft Visual Studio
14.0\VC\include\fstream(13): note: Siehe Deklaration von "std"
16>..\..\libraries\openexr\IlmImf\ImfScanLineInputFile.cpp(69): error
C2873: "min": Das Symbol kann nicht in einer using-Deklaration verwendet
werden
16>..\..\libraries\openexr\IlmImf\ImfScanLineInputFile.cpp(70): error
C2039: "max": Ist kein Element von "std"
16>  H:\Program Files (x86)\Microsoft Visual Studio
14.0\VC\include\fstream(13): note: Siehe Deklaration von "std"
16>..\..\libraries\openexr\IlmImf\ImfScanLineInputFile.cpp(70): error
C2873: "max": Das Symbol kann nicht in einer using-Deklaration verwendet
werden
16>..\..\libraries\openexr\IlmImf\ImfScanLineInputFile.cpp(221): error
C3861: "max": Bezeichner wurde nicht gefunden.
16>..\..\libraries\openexr\IlmImf\ImfScanLineInputFile.cpp(455): error
C3861: "min": Bezeichner wurde nicht gefunden.
16>..\..\libraries\openexr\IlmImf\ImfScanLineInputFile.cpp(638): error
C3861: "max": Bezeichner wurde nicht gefunden.
16>..\..\libraries\openexr\IlmImf\ImfScanLineInputFile.cpp(639): error
C3861: "min": Bezeichner wurde nicht gefunden.
16>..\..\libraries\openexr\IlmImf\ImfScanLineInputFile.cpp(868): error
C3861: "min": Bezeichner wurde nicht gefunden.
16>..\..\libraries\openexr\IlmImf\ImfScanLineInputFile.cpp(869): error
C3861: "max": Bezeichner wurde nicht gefunden.
16>..\..\libraries\openexr\IlmImf\ImfScanLineInputFile.cpp(948): warning
C4018: "<": Konflikt zwischen "signed" und "unsigned"
19>H:\Program Files (x86)\Microsoft Visual Studio
14.0\VC\include\yvals.h(26): warning C4005: "_HAS_CPP0X":
Makro-Neudefinition
19>  H:\Program Files (x86)\Microsoft Visual Studio
14.0\VC\include\yvals.h(26): note: Befehlszeilenargumente: siehe
vorherige Definition von "_HAS_CPP0X"
16>  ImfRleCompressor.cpp
16>H:\Program Files (x86)\Microsoft Visual Studio
14.0\VC\include\yvals.h(26): warning C4005: "_HAS_CPP0X":
Makro-Neudefinition
16>  H:\Program Files (x86)\Microsoft Visual Studio
14.0\VC\include\yvals.h(26): note: Befehlszeilenargumente: siehe
vorherige Definition von "_HAS_CPP0X"
16>  ImfRgbaYca.cpp
16>H:\Program Files (x86)\Microsoft Visual Studio
14.0\VC\include\yvals.h(26): warning C4005: "_HAS_CPP0X":
Makro-Neudefinition
16>  H:\Program Files (x86)\Microsoft Visual Studio
14.0\VC\include\yvals.h(26): note: Befehlszeilenargumente: siehe
vorherige Definition von "_HAS_CPP0X"
19>  menusupport.cpp
16>..\..\libraries\openexr\IlmImf\ImfRgbaYca.cpp(161): warning C4244:
"Argument": Konvertierung von "double" in "float", möglicher Datenverlust
16>..\..\libraries\openexr\IlmImf\ImfRgbaYca.cpp(177): warning C4244:
"Argument": Konvertierung von "double" in "float", möglicher Datenverlust
16>..\..\libraries\openexr\IlmImf\ImfRgbaYca.cpp(209): warning C4244:
"Argument": Konvertierung von "double" in "float", möglicher Datenverlust
16>..\..\libraries\openexr\IlmImf\ImfRgbaYca.cpp(225): warning C4244:
"Argument": Konvertierung von "double" in "float", möglicher Datenverlust
16>..\..\libraries\openexr\IlmImf\ImfRgbaYca.cpp(284): warning C4244:
"Argument": Konvertierung von "double" in "float", möglicher Datenverlust
16>..\..\libraries\openexr\IlmImf\ImfRgbaYca.cpp(299): warning C4244:
"Argument": Konvertierung von "double" in "float", möglicher Datenverlust
16>..\..\libraries\openexr\IlmImf\ImfRgbaYca.cpp(333): warning C4244:
"Argument": Konvertierung von "double" in "float", möglicher Datenverlust
16>..\..\libraries\openexr\IlmImf\ImfRgbaYca.cpp(348): warning C4244:
"Argument": Konvertierung von "double" in "float", möglicher Datenverlust
16>  Code wird generiert...
19>H:\Program Files (x86)\Microsoft Visual Studio
14.0\VC\include\yvals.h(26): warning C4005: "_HAS_CPP0X":
Makro-Neudefinition
19>  H:\Program Files (x86)\Microsoft Visual Studio
14.0\VC\include\yvals.h(26): note: Befehlszeilenargumente: siehe
vorherige Definition von "_HAS_CPP0X"
19>  eventhandlers.cpp
16>  Kompilieren...
16>  ImfRgbaFile.cpp
16>H:\- Setup\Applications\-
3D\POV-Ray\C++\povray-3.7-stable\libraries\openexr\IlmImf\ImfName.h(103): warning
C4996: 'strncpy': This function or variable may be unsafe. Consider
using strncpy_s instead. To disable deprecation, use
_CRT_SECURE_NO_WARNINGS. See online help for details.
16>  C:\Program Files (x86)\Windows
Kits\10\Include\10.0.10240.0\ucrt\string.h(346): note: Siehe Deklaration
von "strncpy"
16>H:\Program Files (x86)\Microsoft Visual Studio
14.0\VC\include\yvals.h(26): warning C4005: "_HAS_CPP0X":
Makro-Neudefinition
16>  H:\Program Files (x86)\Microsoft Visual Studio
14.0\VC\include\yvals.h(26): note: Befehlszeilenargumente: siehe
vorherige Definition von "_HAS_CPP0X"
19>H:\Program Files (x86)\Microsoft Visual Studio
14.0\VC\include\yvals.h(26): warning C4005: "_HAS_CPP0X":
Makro-Neudefinition
19>  H:\Program Files (x86)\Microsoft Visual Studio
14.0\VC\include\yvals.h(26): note: Befehlszeilenargumente: siehe
vorherige Definition von "_HAS_CPP0X"
19>  editorinterface.cpp
16>  ImfRationalAttribute.cpp
16>H:\Program Files (x86)\Microsoft Visual Studio
14.0\VC\include\yvals.h(26): warning C4005: "_HAS_CPP0X":
Makro-Neudefinition
16>  H:\Program Files (x86)\Microsoft Visual Studio
14.0\VC\include\yvals.h(26): note: Befehlszeilenargumente: siehe
vorherige Definition von "_HAS_CPP0X"
19>H:\Program Files (x86)\Microsoft Visual Studio
14.0\VC\include\yvals.h(26): warning C4005: "_HAS_CPP0X":
Makro-Neudefinition
16>  ImfRational.cpp
19>  H:\Program Files (x86)\Microsoft Visual Studio
14.0\VC\include\yvals.h(26): note: Befehlszeilenargumente: siehe
vorherige Definition von "_HAS_CPP0X"
16>H:\Program Files (x86)\Microsoft Visual Studio
14.0\VC\include\yvals.h(26): warning C4005: "_HAS_CPP0X":
Makro-Neudefinition
16>  H:\Program Files (x86)\Microsoft Visual Studio
14.0\VC\include\yvals.h(26): note: Befehlszeilenargumente: siehe
vorherige Definition von "_HAS_CPP0X"
16>  ImfPxr24Compressor.cpp
16>H:\Program Files (x86)\Microsoft Visual Studio
14.0\VC\include\yvals.h(26): warning C4005: "_HAS_CPP0X":
Makro-Neudefinition
16>  H:\Program Files (x86)\Microsoft Visual Studio
14.0\VC\include\yvals.h(26): note: Befehlszeilenargumente: siehe
vorherige Definition von "_HAS_CPP0X"
16>H:\- Setup\Applications\-
3D\POV-Ray\C++\povray-3.7-stable\libraries\openexr\IlmImf\ImfName.h(103): warning
C4996: 'strncpy': This function or variable may be unsafe. Consider
using strncpy_s instead. To disable deprecation, use
_CRT_SECURE_NO_WARNINGS. See online help for details.
16>  C:\Program Files (x86)\Windows
Kits\10\Include\10.0.10240.0\ucrt\string.h(346): note: Siehe Deklaration
von "strncpy"
16>..\..\libraries\openexr\IlmImf\ImfPxr24Compressor.cpp(460): warning
C4018: ">": Konflikt zwischen "signed" und "unsigned"
19>..\cmedit\editorinterface.cpp(846): warning C4996: 'GetVersionExA':
wurde als veraltet deklariert
16>..\..\libraries\openexr\IlmImf\ImfPxr24Compressor.cpp(486): warning
C4018: ">": Konflikt zwischen "signed" und "unsigned"
19>  C:\Program Files (x86)\Windows
Kits\8.1\Include\um\sysinfoapi.h(433): note: Siehe Deklaration von
"GetVersionExA"
16>..\..\libraries\openexr\IlmImf\ImfPxr24Compressor.cpp(510): warning
C4018: ">": Konflikt zwischen "signed" und "unsigned"
16>..\..\libraries\openexr\IlmImf\ImfPxr24Compressor.cpp(535): warning
C4018: "<": Konflikt zwischen "signed" und "unsigned"
16>  ImfPreviewImageAttribute.cpp
16>H:\Program Files (x86)\Microsoft Visual Studio
14.0\VC\include\yvals.h(26): warning C4005: "_HAS_CPP0X":
Makro-Neudefinition
16>  H:\Program Files (x86)\Microsoft Visual Studio
14.0\VC\include\yvals.h(26): note: Befehlszeilenargumente: siehe
vorherige Definition von "_HAS_CPP0X"
19>  dialogs.cpp
16>  ImfPreviewImage.cpp
16>H:\Program Files (x86)\Microsoft Visual Studio
14.0\VC\include\yvals.h(26): warning C4005: "_HAS_CPP0X":
Makro-Neudefinition
16>  H:\Program Files (x86)\Microsoft Visual Studio
14.0\VC\include\yvals.h(26): note: Befehlszeilenargumente: siehe
vorherige Definition von "_HAS_CPP0X"
19>H:\Program Files (x86)\Microsoft Visual Studio
14.0\VC\include\yvals.h(26): warning C4005: "_HAS_CPP0X":
Makro-Neudefinition
19>  H:\Program Files (x86)\Microsoft Visual Studio
14.0\VC\include\yvals.h(26): note: Befehlszeilenargumente: siehe
vorherige Definition von "_HAS_CPP0X"
16>  ImfPizCompressor.cpp
16>H:\Program Files (x86)\Microsoft Visual Studio
14.0\VC\include\yvals.h(26): warning C4005: "_HAS_CPP0X":
Makro-Neudefinition
16>  H:\Program Files (x86)\Microsoft Visual Studio
14.0\VC\include\yvals.h(26): note: Befehlszeilenargumente: siehe
vorherige Definition von "_HAS_CPP0X"
16>H:\- Setup\Applications\-
3D\POV-Ray\C++\povray-3.7-stable\libraries\openexr\IlmImf\ImfName.h(103): warning
C4996: 'strncpy': This function or variable may be unsafe. Consider
using strncpy_s instead. To disable deprecation, use
_CRT_SECURE_NO_WARNINGS. See online help for details.
16>  C:\Program Files (x86)\Windows
Kits\10\Include\10.0.10240.0\ucrt\string.h(346): note: Siehe Deklaration
von "strncpy"
19>  cmedit.cpp
16>  ImfOutputFile.cpp
16>H:\- Setup\Applications\-
3D\POV-Ray\C++\povray-3.7-stable\libraries\openexr\IlmImf\ImfName.h(103): warning
C4996: 'strncpy': This function or variable may be unsafe. Consider
using strncpy_s instead. To disable deprecation, use
_CRT_SECURE_NO_WARNINGS. See online help for details.
16>  C:\Program Files (x86)\Windows
Kits\10\Include\10.0.10240.0\ucrt\string.h(346): note: Siehe Deklaration
von "strncpy"
16>H:\Program Files (x86)\Microsoft Visual Studio
14.0\VC\include\yvals.h(26): warning C4005: "_HAS_CPP0X":
Makro-Neudefinition
16>  H:\Program Files (x86)\Microsoft Visual Studio
14.0\VC\include\yvals.h(26): note: Befehlszeilenargumente: siehe
vorherige Definition von "_HAS_CPP0X"
19>H:\Program Files (x86)\Microsoft Visual Studio
14.0\VC\include\yvals.h(26): warning C4005: "_HAS_CPP0X":
Makro-Neudefinition
19>  H:\Program Files (x86)\Microsoft Visual Studio
14.0\VC\include\yvals.h(26): note: Befehlszeilenargumente: siehe
vorherige Definition von "_HAS_CPP0X"
16>..\..\libraries\openexr\IlmImf\ImfOutputFile.cpp(71): error C2039:
"min": Ist kein Element von "std"
16>  H:\Program Files (x86)\Microsoft Visual Studio
14.0\VC\include\vector(17): note: Siehe Deklaration von "std"
16>..\..\libraries\openexr\IlmImf\ImfOutputFile.cpp(71): error C2873:
"min": Das Symbol kann nicht in einer using-Deklaration verwendet werden
16>..\..\libraries\openexr\IlmImf\ImfOutputFile.cpp(72): error C2039:
"max": Ist kein Element von "std"
16>  H:\Program Files (x86)\Microsoft Visual Studio
14.0\VC\include\vector(17): note: Siehe Deklaration von "std"
16>..\..\libraries\openexr\IlmImf\ImfOutputFile.cpp(72): error C2873:
"max": Das Symbol kann nicht in einer using-Deklaration verwendet werden
16>..\..\libraries\openexr\IlmImf\ImfOutputFile.cpp(221): error C3861:
"max": Bezeichner wurde nicht gefunden.
16>..\..\libraries\openexr\IlmImf\ImfOutputFile.cpp(335): error C3861:
"max": Bezeichner wurde nicht gefunden.
16>..\..\libraries\openexr\IlmImf\ImfOutputFile.cpp(336): error C3861:
"min": Bezeichner wurde nicht gefunden.
16>..\..\libraries\openexr\IlmImf\ImfOutputFile.cpp(341): error C3861:
"min": Bezeichner wurde nicht gefunden.
16>..\..\libraries\openexr\IlmImf\ImfOutputFile.cpp(342): error C3861:
"max": Bezeichner wurde nicht gefunden.
16>..\..\libraries\openexr\IlmImf\ImfOutputFile.cpp(450): error C3861:
"min": Bezeichner wurde nicht gefunden.
16>..\..\libraries\openexr\IlmImf\ImfOutputFile.cpp(456): error C3861:
"max": Bezeichner wurde nicht gefunden.
16>..\..\libraries\openexr\IlmImf\ImfOutputFile.cpp(457): error C3861:
"min": Bezeichner wurde nicht gefunden.
16>..\..\libraries\openexr\IlmImf\ImfOutputFile.cpp(955): error C3861:
"min": Bezeichner wurde nicht gefunden.
16>..\..\libraries\openexr\IlmImf\ImfOutputFile.cpp(955): error C3861:
"max": Bezeichner wurde nicht gefunden.
16>..\..\libraries\openexr\IlmImf\ImfOutputFile.cpp(978): error C3861:
"min": Bezeichner wurde nicht gefunden.
16>..\..\libraries\openexr\IlmImf\ImfOutputFile.cpp(978): error C3861:
"max": Bezeichner wurde nicht gefunden.
16>..\..\libraries\openexr\IlmImf\ImfOutputFile.cpp(1107): warning
C4018: "<": Konflikt zwischen "signed" und "unsigned"
16>  ImfOpaqueAttribute.cpp
16>H:\Program Files (x86)\Microsoft Visual Studio
14.0\VC\include\yvals.h(26): warning C4005: "_HAS_CPP0X":
Makro-Neudefinition
16>  H:\Program Files (x86)\Microsoft Visual Studio
14.0\VC\include\yvals.h(26): note: Befehlszeilenargumente: siehe
vorherige Definition von "_HAS_CPP0X"
19>  ccodemax.cpp
16>..\..\libraries\openexr\IlmImf\ImfOpaqueAttribute.cpp(54): warning
C4996: 'strcpy': This function or variable may be unsafe. Consider using
strcpy_s instead. To disable deprecation, use _CRT_SECURE_NO_WARNINGS.
See online help for details.
16>  C:\Program Files (x86)\Windows
Kits\10\Include\10.0.10240.0\ucrt\string.h(119): note: Siehe Deklaration
von "strcpy"
16>..\..\libraries\openexr\IlmImf\ImfOpaqueAttribute.cpp(63): warning
C4996: 'strcpy': This function or variable may be unsafe. Consider using
strcpy_s instead. To disable deprecation, use _CRT_SECURE_NO_WARNINGS.
See online help for details.
16>  C:\Program Files (x86)\Windows
Kits\10\Include\10.0.10240.0\ucrt\string.h(119): note: Siehe Deklaration
von "strcpy"
16>  ImfMisc.cpp
16>H:\Program Files (x86)\Microsoft Visual Studio
14.0\VC\include\yvals.h(26): warning C4005: "_HAS_CPP0X":
Makro-Neudefinition
16>  H:\Program Files (x86)\Microsoft Visual Studio
14.0\VC\include\yvals.h(26): note: Befehlszeilenargumente: siehe
vorherige Definition von "_HAS_CPP0X"
19>H:\Program Files (x86)\Microsoft Visual Studio
14.0\VC\include\yvals.h(26): warning C4005: "_HAS_CPP0X":
Makro-Neudefinition
19>  H:\Program Files (x86)\Microsoft Visual Studio
14.0\VC\include\yvals.h(26): note: Befehlszeilenargumente: siehe
vorherige Definition von "_HAS_CPP0X"
16>H:\- Setup\Applications\-
3D\POV-Ray\C++\povray-3.7-stable\libraries\openexr\IlmImf\ImfName.h(103): warning
C4996: 'strncpy': This function or variable may be unsafe. Consider
using strncpy_s instead. To disable deprecation, use
_CRT_SECURE_NO_WARNINGS. See online help for details.
16>  C:\Program Files (x86)\Windows
Kits\10\Include\10.0.10240.0\ucrt\string.h(346): note: Siehe Deklaration
von "strncpy"
16>..\..\libraries\openexr\IlmImf\ImfMisc.cpp(141): warning C4018: "<":
Konflikt zwischen "signed" und "unsigned"
16>..\..\libraries\openexr\IlmImf\ImfMisc.cpp(221): warning C4244:
"Argument": Konvertierung von "double" in "float", möglicher Datenverlust
16>..\..\libraries\openexr\IlmImf\ImfMisc.cpp(567): warning C4018: "<":
Konflikt zwischen "signed" und "unsigned"
16>..\..\libraries\openexr\IlmImf\ImfMisc.cpp(576): warning C4018: "<":
Konflikt zwischen "signed" und "unsigned"
16>..\..\libraries\openexr\IlmImf\ImfMisc.cpp(585): warning C4018: "<":
Konflikt zwischen "signed" und "unsigned"
16>..\..\libraries\openexr\IlmImf\ImfMisc.cpp(717): warning C4018: "<":
Konflikt zwischen "signed" und "unsigned"
16>..\..\libraries\openexr\IlmImf\ImfMisc.cpp(724): warning C4018: "<":
Konflikt zwischen "signed" und "unsigned"
16>..\..\libraries\openexr\IlmImf\ImfMisc.cpp(731): warning C4018: "<":
Konflikt zwischen "signed" und "unsigned"
16>..\..\libraries\openexr\IlmImf\ImfMisc.cpp(751): warning C4018: "<":
Konflikt zwischen "signed" und "unsigned"
16>..\..\libraries\openexr\IlmImf\ImfMisc.cpp(762): warning C4018: "<":
Konflikt zwischen "signed" und "unsigned"
16>..\..\libraries\openexr\IlmImf\ImfMisc.cpp(771): warning C4018: "<":
Konflikt zwischen "signed" und "unsigned"
16>  ImfMatrixAttribute.cpp
16>H:\Program Files (x86)\Microsoft Visual Studio
14.0\VC\include\yvals.h(26): warning C4005: "_HAS_CPP0X":
Makro-Neudefinition
16>  H:\Program Files (x86)\Microsoft Visual Studio
14.0\VC\include\yvals.h(26): note: Befehlszeilenargumente: siehe
vorherige Definition von "_HAS_CPP0X"
19>  Code wird generiert...
16>  ImfLut.cpp
16>H:\- Setup\Applications\-
3D\POV-Ray\C++\povray-3.7-stable\libraries\openexr\IlmImf\ImfName.h(103): warning
C4996: 'strncpy': This function or variable may be unsafe. Consider
using strncpy_s instead. To disable deprecation, use
_CRT_SECURE_NO_WARNINGS. See online help for details.
16>  C:\Program Files (x86)\Windows
Kits\10\Include\10.0.10240.0\ucrt\string.h(346): note: Siehe Deklaration
von "strncpy"
16>H:\Program Files (x86)\Microsoft Visual Studio
14.0\VC\include\yvals.h(26): warning C4005: "_HAS_CPP0X":
Makro-Neudefinition
16>  H:\Program Files (x86)\Microsoft Visual Studio
14.0\VC\include\yvals.h(26): note: Befehlszeilenargumente: siehe
vorherige Definition von "_HAS_CPP0X"
16>..\..\libraries\openexr\IlmImf\ImfLut.cpp(155): warning C4244:
"Initialisierung": Konvertierung von "double" in "float", möglicher
Datenverlust
16>..\..\libraries\openexr\IlmImf\ImfLut.cpp(155): warning C4244:
"Initialisierung": Konvertierung von "double" in "const float",
möglicher Datenverlust
16>..\..\libraries\openexr\IlmImf\ImfLut.cpp(173): warning C4244:
"Argument": Konvertierung von "double" in "float", möglicher Datenverlust
16>  ImfLineOrderAttribute.cpp
16>H:\Program Files (x86)\Microsoft Visual Studio
14.0\VC\include\yvals.h(26): warning C4005: "_HAS_CPP0X":
Makro-Neudefinition
16>  H:\Program Files (x86)\Microsoft Visual Studio
14.0\VC\include\yvals.h(26): note: Befehlszeilenargumente: siehe
vorherige Definition von "_HAS_CPP0X"
16>  ImfKeyCodeAttribute.cpp
16>H:\Program Files (x86)\Microsoft Visual Studio
14.0\VC\include\yvals.h(26): warning C4005: "_HAS_CPP0X":
Makro-Neudefinition
16>  H:\Program Files (x86)\Microsoft Visual Studio
14.0\VC\include\yvals.h(26): note: Befehlszeilenargumente: siehe
vorherige Definition von "_HAS_CPP0X"
16>  ImfKeyCode.cpp
16>H:\Program Files (x86)\Microsoft Visual Studio
14.0\VC\include\yvals.h(26): warning C4005: "_HAS_CPP0X":
Makro-Neudefinition
16>  H:\Program Files (x86)\Microsoft Visual Studio
14.0\VC\include\yvals.h(26): note: Befehlszeilenargumente: siehe
vorherige Definition von "_HAS_CPP0X"
16>  ImfIO.cpp
16>H:\Program Files (x86)\Microsoft Visual Studio
14.0\VC\include\yvals.h(26): warning C4005: "_HAS_CPP0X":
Makro-Neudefinition
16>  H:\Program Files (x86)\Microsoft Visual Studio
14.0\VC\include\yvals.h(26): note: Befehlszeilenargumente: siehe
vorherige Definition von "_HAS_CPP0X"
16>  ImfIntAttribute.cpp
16>H:\Program Files (x86)\Microsoft Visual Studio
14.0\VC\include\yvals.h(26): warning C4005: "_HAS_CPP0X":
Makro-Neudefinition
16>  H:\Program Files (x86)\Microsoft Visual Studio
14.0\VC\include\yvals.h(26): note: Befehlszeilenargumente: siehe
vorherige Definition von "_HAS_CPP0X"
16>  ImfInputFile.cpp
16>H:\- Setup\Applications\-
3D\POV-Ray\C++\povray-3.7-stable\libraries\openexr\IlmImf\ImfName.h(103): warning
C4996: 'strncpy': This function or variable may be unsafe. Consider
using strncpy_s instead. To disable deprecation, use
_CRT_SECURE_NO_WARNINGS. See online help for details.
16>  C:\Program Files (x86)\Windows
Kits\10\Include\10.0.10240.0\ucrt\string.h(346): note: Siehe Deklaration
von "strncpy"
16>H:\Program Files (x86)\Microsoft Visual Studio
14.0\VC\include\yvals.h(26): warning C4005: "_HAS_CPP0X":
Makro-Neudefinition
16>  H:\Program Files (x86)\Microsoft Visual Studio
14.0\VC\include\yvals.h(26): note: Befehlszeilenargumente: siehe
vorherige Definition von "_HAS_CPP0X"
16>..\..\libraries\openexr\IlmImf\ImfInputFile.cpp(296): warning C4018:
"<": Konflikt zwischen "signed" und "unsigned"
16>  ImfHuf.cpp
16>H:\Program Files (x86)\Microsoft Visual Studio
14.0\VC\include\yvals.h(26): warning C4005: "_HAS_CPP0X":
Makro-Neudefinition
16>  H:\Program Files (x86)\Microsoft Visual Studio
14.0\VC\include\yvals.h(26): note: Befehlszeilenargumente: siehe
vorherige Definition von "_HAS_CPP0X"
16>..\..\libraries\openexr\IlmImf\ImfHuf.cpp(168): warning C4244: "=":
Konvertierung von "Imath::Int64" in "char", möglicher Datenverlust
16>..\..\libraries\openexr\IlmImf\ImfHuf.cpp(247): warning C4244:
"Initialisierung": Konvertierung von "Imath::Int64" in "int", möglicher
Datenverlust
16>..\..\libraries\openexr\IlmImf\ImfHuf.cpp(478): warning C4244:
"Initialisierung": Konvertierung von "Imath::Int64" in "int", möglicher
Datenverlust
16>..\..\libraries\openexr\IlmImf\ImfHuf.cpp(547): warning C4244:
"Initialisierung": Konvertierung von "Imath::Int64" in "int", möglicher
Datenverlust
16>..\..\libraries\openexr\IlmImf\ImfHuf.cpp(559): warning C4244:
"Initialisierung": Konvertierung von "Imath::Int64" in "int", möglicher
Datenverlust
16>..\..\libraries\openexr\IlmImf\ImfHuf.cpp(606): warning C4244:
"Initialisierung": Konvertierung von "Imath::Int64" in "int", möglicher
Datenverlust
16>..\..\libraries\openexr\IlmImf\ImfHuf.cpp(709): warning C4244:
"Argument": Konvertierung von "Imath::Int64" in "int", möglicher
Datenverlust
16>..\..\libraries\openexr\IlmImf\ImfHuf.cpp(877): warning C4244:
"Initialisierung": Konvertierung von "Imath::Int64" in "unsigned char",
möglicher Datenverlust
16>..\..\libraries\openexr\IlmImf\ImfHuf.cpp(892): warning C4244:
"Initialisierung": Konvertierung von "Imath::Int64" in "int", möglicher
Datenverlust
16>..\..\libraries\openexr\IlmImf\ImfHuf.cpp(907): warning C4244:
"Initialisierung": Konvertierung von "Imath::Int64" in "unsigned char",
möglicher Datenverlust
16>..\..\libraries\openexr\IlmImf\ImfHuf.cpp(934): warning C4244:
"Initialisierung": Konvertierung von "Imath::Int64" in "unsigned char",
möglicher Datenverlust
16>  ImfHeader.cpp
16>H:\- Setup\Applications\-
3D\POV-Ray\C++\povray-3.7-stable\libraries\openexr\IlmImf\ImfName.h(103): warning
C4996: 'strncpy': This function or variable may be unsafe. Consider
using strncpy_s instead. To disable deprecation, use
_CRT_SECURE_NO_WARNINGS. See online help for details.
16>  C:\Program Files (x86)\Windows
Kits\10\Include\10.0.10240.0\ucrt\string.h(346): note: Siehe Deklaration
von "strncpy"
16>H:\Program Files (x86)\Microsoft Visual Studio
14.0\VC\include\yvals.h(26): warning C4005: "_HAS_CPP0X":
Makro-Neudefinition
16>  H:\Program Files (x86)\Microsoft Visual Studio
14.0\VC\include\yvals.h(26): note: Befehlszeilenargumente: siehe
vorherige Definition von "_HAS_CPP0X"
16>..\..\libraries\openexr\IlmImf\ImfHeader.cpp(582): warning C4305:
"Initialisierung": Verkürzung von "double" in "float"
16>..\..\libraries\openexr\IlmImf\ImfHeader.cpp(627): warning C4018:
"<": Konflikt zwischen "signed" und "unsigned"
16>..\..\libraries\openexr\IlmImf\ImfHeader.cpp(634): warning C4018:
"<": Konflikt zwischen "signed" und "unsigned"
16>  Code wird generiert...
16>  Kompilieren...
16>  ImfFramesPerSecond.cpp
16>  ImfFrameBuffer.cpp
16>H:\- Setup\Applications\-
3D\POV-Ray\C++\povray-3.7-stable\libraries\openexr\IlmImf\ImfName.h(103): warning
C4996: 'strncpy': This function or variable may be unsafe. Consider
using strncpy_s instead. To disable deprecation, use
_CRT_SECURE_NO_WARNINGS. See online help for details.
16>  C:\Program Files (x86)\Windows
Kits\10\Include\10.0.10240.0\ucrt\string.h(346): note: Siehe Deklaration
von "strncpy"
16>H:\Program Files (x86)\Microsoft Visual Studio
14.0\VC\include\yvals.h(26): warning C4005: "_HAS_CPP0X":
Makro-Neudefinition
16>  H:\Program Files (x86)\Microsoft Visual Studio
14.0\VC\include\yvals.h(26): note: Befehlszeilenargumente: siehe
vorherige Definition von "_HAS_CPP0X"
16>  ImfFloatAttribute.cpp
16>H:\Program Files (x86)\Microsoft Visual Studio
14.0\VC\include\yvals.h(26): warning C4005: "_HAS_CPP0X":
Makro-Neudefinition
16>  H:\Program Files (x86)\Microsoft Visual Studio
14.0\VC\include\yvals.h(26): note: Befehlszeilenargumente: siehe
vorherige Definition von "_HAS_CPP0X"
16>  ImfEnvmapAttribute.cpp
16>H:\Program Files (x86)\Microsoft Visual Studio
14.0\VC\include\yvals.h(26): warning C4005: "_HAS_CPP0X":
Makro-Neudefinition
16>  H:\Program Files (x86)\Microsoft Visual Studio
14.0\VC\include\yvals.h(26): note: Befehlszeilenargumente: siehe
vorherige Definition von "_HAS_CPP0X"
19>     Bibliothek "bin32\lib/cmedit32d.lib" und Objekt
"bin32\lib/cmedit32d.exp" werden erstellt.
16>  ImfEnvmap.cpp
16>H:\Program Files (x86)\Microsoft Visual Studio
14.0\VC\include\yvals.h(26): warning C4005: "_HAS_CPP0X":
Makro-Neudefinition
16>  H:\Program Files (x86)\Microsoft Visual Studio
14.0\VC\include\yvals.h(26): note: Befehlszeilenargumente: siehe
vorherige Definition von "_HAS_CPP0X"
16>..\..\libraries\openexr\IlmImf\ImfEnvmap.cpp(77): warning C4244: "=":
Konvertierung von "double" in "float", möglicher Datenverlust
16>..\..\libraries\openexr\IlmImf\ImfEnvmap.cpp(88): warning C4244: "=":
Konvertierung von "double" in "float", möglicher Datenverlust
16>..\..\libraries\openexr\IlmImf\ImfEnvmap.cpp(102): warning C4244:
"Initialisierung": Konvertierung von "double" in "float", möglicher
Datenverlust
16>..\..\libraries\openexr\IlmImf\ImfEnvmap.cpp(103): warning C4244:
"Initialisierung": Konvertierung von "double" in "float", möglicher
Datenverlust
16>  ImfDoubleAttribute.cpp
16>H:\Program Files (x86)\Microsoft Visual Studio
14.0\VC\include\yvals.h(26): warning C4005: "_HAS_CPP0X":
Makro-Neudefinition
16>  H:\Program Files (x86)\Microsoft Visual Studio
14.0\VC\include\yvals.h(26): note: Befehlszeilenargumente: siehe
vorherige Definition von "_HAS_CPP0X"
16>  ImfCRgbaFile.cpp
16>H:\- Setup\Applications\-
3D\POV-Ray\C++\povray-3.7-stable\libraries\openexr\IlmImf\ImfName.h(103): warning
C4996: 'strncpy': This function or variable may be unsafe. Consider
using strncpy_s instead. To disable deprecation, use
_CRT_SECURE_NO_WARNINGS. See online help for details.
16>  C:\Program Files (x86)\Windows
Kits\10\Include\10.0.10240.0\ucrt\string.h(346): note: Siehe Deklaration
von "strncpy"
16>H:\Program Files (x86)\Microsoft Visual Studio
14.0\VC\include\yvals.h(26): warning C4005: "_HAS_CPP0X":
Makro-Neudefinition
16>  H:\Program Files (x86)\Microsoft Visual Studio
14.0\VC\include\yvals.h(26): note: Befehlszeilenargumente: siehe
vorherige Definition von "_HAS_CPP0X"
16>..\..\libraries\openexr\IlmImf\ImfCRgbaFile.cpp(78): warning C4996:
'strncpy': This function or variable may be unsafe. Consider using
strncpy_s instead. To disable deprecation, use _CRT_SECURE_NO_WARNINGS.
See online help for details.
16>  C:\Program Files (x86)\Windows
Kits\10\Include\10.0.10240.0\ucrt\string.h(346): note: Siehe Deklaration
von "strncpy"
16>..\..\libraries\openexr\IlmImf\ImfCRgbaFile.cpp(292): warning C4244:
"=": Konvertierung von "const int" in "float", möglicher Datenverlust
16>..\..\libraries\openexr\IlmImf\ImfCRgbaFile.cpp(293): warning C4244:
"=": Konvertierung von "const int" in "float", möglicher Datenverlust
16>  ImfConvert.cpp
16>H:\Program Files (x86)\Microsoft Visual Studio
14.0\VC\include\yvals.h(26): warning C4005: "_HAS_CPP0X":
Makro-Neudefinition
16>  H:\Program Files (x86)\Microsoft Visual Studio
14.0\VC\include\yvals.h(26): note: Befehlszeilenargumente: siehe
vorherige Definition von "_HAS_CPP0X"
19>  cmedit.vcxproj -> H:\- Setup\Applications\-
3D\POV-Ray\C++\povray-3.7-stable\windows\vs10\bin32\cmedit32d.dll
16>..\..\libraries\openexr\IlmImf\ImfConvert.cpp(119): warning C4244:
"Argument": Konvertierung von "unsigned int" in "float", möglicher
Datenverlust
16>  ImfCompressor.cpp
16>H:\Program Files (x86)\Microsoft Visual Studio
14.0\VC\include\yvals.h(26): warning C4005: "_HAS_CPP0X":
Makro-Neudefinition
16>  H:\Program Files (x86)\Microsoft Visual Studio
14.0\VC\include\yvals.h(26): note: Befehlszeilenargumente: siehe
vorherige Definition von "_HAS_CPP0X"
16>  ImfCompressionAttribute.cpp
16>H:\Program Files (x86)\Microsoft Visual Studio
14.0\VC\include\yvals.h(26): warning C4005: "_HAS_CPP0X":
Makro-Neudefinition
16>  H:\Program Files (x86)\Microsoft Visual Studio
14.0\VC\include\yvals.h(26): note: Befehlszeilenargumente: siehe
vorherige Definition von "_HAS_CPP0X"
16>  ImfChromaticitiesAttribute.cpp
16>H:\Program Files (x86)\Microsoft Visual Studio
14.0\VC\include\yvals.h(26): warning C4005: "_HAS_CPP0X":
Makro-Neudefinition
16>  H:\Program Files (x86)\Microsoft Visual Studio
14.0\VC\include\yvals.h(26): note: Befehlszeilenargumente: siehe
vorherige Definition von "_HAS_CPP0X"
16>  ImfChromaticities.cpp
16>H:\Program Files (x86)\Microsoft Visual Studio
14.0\VC\include\yvals.h(26): warning C4005: "_HAS_CPP0X":
Makro-Neudefinition
16>  H:\Program Files (x86)\Microsoft Visual Studio
14.0\VC\include\yvals.h(26): note: Befehlszeilenargumente: siehe
vorherige Definition von "_HAS_CPP0X"
16>  ImfChannelListAttribute.cpp
16>H:\Program Files (x86)\Microsoft Visual Studio
14.0\VC\include\yvals.h(26): warning C4005: "_HAS_CPP0X":
Makro-Neudefinition
16>  H:\Program Files (x86)\Microsoft Visual Studio
14.0\VC\include\yvals.h(26): note: Befehlszeilenargumente: siehe
vorherige Definition von "_HAS_CPP0X"
16>H:\- Setup\Applications\-
3D\POV-Ray\C++\povray-3.7-stable\libraries\openexr\IlmImf\ImfName.h(103): warning
C4996: 'strncpy': This function or variable may be unsafe. Consider
using strncpy_s instead. To disable deprecation, use
_CRT_SECURE_NO_WARNINGS. See online help for details.
16>  C:\Program Files (x86)\Windows
Kits\10\Include\10.0.10240.0\ucrt\string.h(346): note: Siehe Deklaration
von "strncpy"
16>  ImfChannelList.cpp
16>H:\- Setup\Applications\-
3D\POV-Ray\C++\povray-3.7-stable\libraries\openexr\IlmImf\ImfName.h(103): warning
C4996: 'strncpy': This function or variable may be unsafe. Consider
using strncpy_s instead. To disable deprecation, use
_CRT_SECURE_NO_WARNINGS. See online help for details.
16>  C:\Program Files (x86)\Windows
Kits\10\Include\10.0.10240.0\ucrt\string.h(346): note: Siehe Deklaration
von "strncpy"
16>H:\Program Files (x86)\Microsoft Visual Studio
14.0\VC\include\yvals.h(26): warning C4005: "_HAS_CPP0X":
Makro-Neudefinition
16>  H:\Program Files (x86)\Microsoft Visual Studio
14.0\VC\include\yvals.h(26): note: Befehlszeilenargumente: siehe
vorherige Definition von "_HAS_CPP0X"
16>  ImfBoxAttribute.cpp
16>H:\Program Files (x86)\Microsoft Visual Studio
14.0\VC\include\yvals.h(26): warning C4005: "_HAS_CPP0X":
Makro-Neudefinition
16>  H:\Program Files (x86)\Microsoft Visual Studio
14.0\VC\include\yvals.h(26): note: Befehlszeilenargumente: siehe
vorherige Definition von "_HAS_CPP0X"
16>  ImfB44Compressor.cpp
16>H:\Program Files (x86)\Microsoft Visual Studio
14.0\VC\include\yvals.h(26): warning C4005: "_HAS_CPP0X":
Makro-Neudefinition
16>  H:\Program Files (x86)\Microsoft Visual Studio
14.0\VC\include\yvals.h(26): note: Befehlszeilenargumente: siehe
vorherige Definition von "_HAS_CPP0X"
16>H:\- Setup\Applications\-
3D\POV-Ray\C++\povray-3.7-stable\libraries\openexr\IlmImf\ImfName.h(103): warning
C4996: 'strncpy': This function or variable may be unsafe. Consider
using strncpy_s instead. To disable deprecation, use
_CRT_SECURE_NO_WARNINGS. See online help for details.
16>  C:\Program Files (x86)\Windows
Kits\10\Include\10.0.10240.0\ucrt\string.h(346): note: Siehe Deklaration
von "strncpy"
16>..\..\libraries\openexr\IlmImf\ImfB44Compressor.cpp(130): fatal error
C1083: Datei (Include) kann nicht geöffnet werden: "b44ExpLogTable.h":
No such file or directory
16>  ImfAttribute.cpp
16>H:\Program Files (x86)\Microsoft Visual Studio
14.0\VC\include\yvals.h(26): warning C4005: "_HAS_CPP0X":
Makro-Neudefinition
16>  H:\Program Files (x86)\Microsoft Visual Studio
14.0\VC\include\yvals.h(26): note: Befehlszeilenargumente: siehe
vorherige Definition von "_HAS_CPP0X"
16>  Code wird generiert...
20>------ Erstellen gestartet: Projekt: GUI, Konfiguration: Debug Win32
------
20>  winprecomp.cpp
20>H:\Program Files (x86)\Microsoft Visual Studio
14.0\VC\include\yvals.h(26): warning C4005: "_HAS_CPP0X":
Makro-Neudefinition
20>  H:\Program Files (x86)\Microsoft Visual Studio
14.0\VC\include\yvals.h(26): note: Befehlszeilenargumente: siehe
vorherige Definition von "_HAS_CPP0X"
20>  Unknown compiler version - please run the configure tests and
report the results
20>H:\- Setup\Applications\-
3D\POV-Ray\C++\povray-3.7-stable\libraries\boost\boost/thread/xtime.hpp(23):
error C2059: Syntaxfehler: "Konstante"
20>H:\- Setup\Applications\-
3D\POV-Ray\C++\povray-3.7-stable\libraries\boost\boost/thread/xtime.hpp(31):
error C2143: Syntaxfehler: Es fehlt ";" vor "}"
20>H:\- Setup\Applications\-
3D\POV-Ray\C++\povray-3.7-stable\libraries\boost\boost/thread/xtime.hpp(46):
error C2833: Operator "system_time" ist kein bekannter Operator oder Typ
20>H:\- Setup\Applications\-
3D\POV-Ray\C++\povray-3.7-stable\libraries\boost\boost/thread/xtime.hpp(46):
error C2059: Syntaxfehler: "newline"
20>H:\- Setup\Applications\-
3D\POV-Ray\C++\povray-3.7-stable\libraries\boost\boost/thread/xtime.hpp(47):
error C2334: Unerwartete(s) Token vor "{"; sichtbarer Funktionstext wird
übersprungen
20>H:\- Setup\Applications\-
3D\POV-Ray\C++\povray-3.7-stable\libraries\boost\boost/thread/xtime.hpp(73):
error C3861: "get_system_time": Bezeichner wurde nicht gefunden.
20>H:\- Setup\Applications\-
3D\POV-Ray\C++\povray-3.7-stable\libraries\boost\boost/thread/xtime.hpp(88):
error C2059: Syntaxfehler: "}"
20>H:\- Setup\Applications\-
3D\POV-Ray\C++\povray-3.7-stable\libraries\boost\boost/thread/xtime.hpp(88):
error C2143: Syntaxfehler: Es fehlt ";" vor "}"
20>h:\- setup\applications\-
3d\pov-ray\c++\povray-3.7-stable\libraries\boost\boost\thread\win32\basic_timed_mutex.hpp(22):
error C2143: Syntaxfehler: Es fehlt ";" vor "{"
20>h:\- setup\applications\-
3d\pov-ray\c++\povray-3.7-stable\libraries\boost\boost\thread\win32\basic_timed_mutex.hpp(22):
error C2447: "{": Funktionsheader fehlt - Parameterliste im alten Stil?
20>H:\- Setup\Applications\-
3D\POV-Ray\C++\povray-3.7-stable\libraries\boost\boost/thread/win32/mutex.hpp(19):
error C2039: "basic_timed_mutex": Ist kein Element von "boost::detail"
20>  H:\- Setup\Applications\-
3D\POV-Ray\C++\povray-3.7-stable\libraries\boost\boost/thread/win32/mutex.hpp(17):
note: Siehe Deklaration von "boost::detail"
20>H:\- Setup\Applications\-
3D\POV-Ray\C++\povray-3.7-stable\libraries\boost\boost/thread/win32/mutex.hpp(19):
error C4430: Fehlender Typspezifizierer - int wird angenommen. Hinweis:
"default-int" wird von C++ nicht unterstützt.
20>H:\- Setup\Applications\-
3D\POV-Ray\C++\povray-3.7-stable\libraries\boost\boost/thread/win32/mutex.hpp(19):
error C2146: Syntaxfehler: Fehlendes ";" vor Bezeichner "underlying_mutex"
20>H:\- Setup\Applications\-
3D\POV-Ray\C++\povray-3.7-stable\libraries\boost\boost/thread/win32/mutex.hpp(24):
error C2039: "underlying_mutex": Ist kein Element von "boost::detail"
20>  H:\- Setup\Applications\-
3D\POV-Ray\C++\povray-3.7-stable\libraries\boost\boost/thread/win32/mutex.hpp(17):
note: Siehe Deklaration von "boost::detail"
20>H:\- Setup\Applications\-
3D\POV-Ray\C++\povray-3.7-stable\libraries\boost\boost/thread/win32/mutex.hpp(24):
error C2504: "underlying_mutex": Basisklasse undefiniert
20>H:\- Setup\Applications\-
3D\POV-Ray\C++\povray-3.7-stable\libraries\boost\boost/thread/win32/mutex.hpp(31):
error C3861: "initialize": Bezeichner wurde nicht gefunden.
20>H:\- Setup\Applications\-
3D\POV-Ray\C++\povray-3.7-stable\libraries\boost\boost/thread/win32/mutex.hpp(35):
error C3861: "destroy": Bezeichner wurde nicht gefunden.
20>H:\- Setup\Applications\-
3D\POV-Ray\C++\povray-3.7-stable\libraries\boost\boost/thread/win32/mutex.hpp(46):
error C2516: "boost::detail::basic_timed_mutex": Keine zulässige Basisklasse
20>  H:\- Setup\Applications\-
3D\POV-Ray\C++\povray-3.7-stable\libraries\boost\boost/thread/win32/mutex.hpp(19):
note: Siehe Deklaration von "boost::detail::basic_timed_mutex"
20>H:\- Setup\Applications\-
3D\POV-Ray\C++\povray-3.7-stable\libraries\boost\boost/thread/win32/mutex.hpp(53):
error C3861: "initialize": Bezeichner wurde nicht gefunden.
20>H:\- Setup\Applications\-
3D\POV-Ray\C++\povray-3.7-stable\libraries\boost\boost/thread/win32/mutex.hpp(58):
error C3861: "destroy": Bezeichner wurde nicht gefunden.
20>H:\- Setup\Applications\-
3D\POV-Ray\C++\povray-3.7-stable\libraries\boost\boost/thread/detail/thread.hpp(385):
error C2440: "<function-style-cast>": "const boost::xtime" kann nicht in
"boost::system_time" konvertiert werden
20>  H:\- Setup\Applications\-
3D\POV-Ray\C++\povray-3.7-stable\libraries\boost\boost/thread/detail/thread.hpp(385):
note: Quelltyp konnte von keinem Konstruktor angenommen werden, oder die
Überladungsauflösung des Konstruktors ist mehrdeutig
20>H:\- Setup\Applications\-
3D\POV-Ray\C++\povray-3.7-stable\libraries\boost\boost/thread/win32/condition_variable.hpp(327):
error C2440: "<function-style-cast>": "const boost::xtime" kann nicht in
"boost::system_time" konvertiert werden
20>  H:\- Setup\Applications\-
3D\POV-Ray\C++\povray-3.7-stable\libraries\boost\boost/thread/win32/condition_variable.hpp(327):
note: Quelltyp konnte von keinem Konstruktor angenommen werden, oder die
Überladungsauflösung des Konstruktors ist mehrdeutig
20>H:\- Setup\Applications\-
3D\POV-Ray\C++\povray-3.7-stable\libraries\boost\boost/thread/win32/condition_variable.hpp(327):
error C2672: "boost::detail::basic_condition_variable::do_wait": keine
übereinstimmende überladene Funktion gefunden
20>H:\- Setup\Applications\-
3D\POV-Ray\C++\povray-3.7-stable\libraries\boost\boost/thread/win32/condition_variable.hpp(327):
error C2780: "bool
boost::detail::basic_condition_variable::do_wait(lock_type &,const
boost::detail::timeout &,predicate_type)": Erwartet 3 Argumente - 1
unterstützt
20>  H:\- Setup\Applications\-
3D\POV-Ray\C++\povray-3.7-stable\libraries\boost\boost/thread/win32/condition_variable.hpp(229):
note: Siehe Deklaration von
"boost::detail::basic_condition_variable::do_wait"
20>H:\- Setup\Applications\-
3D\POV-Ray\C++\povray-3.7-stable\libraries\boost\boost/thread/win32/condition_variable.hpp(327):
error C2780: "bool
boost::detail::basic_condition_variable::do_wait(lock_type
&,boost::detail::timeout)": Erwartet 2 Argumente - 1 unterstützt
20>  H:\- Setup\Applications\-
3D\POV-Ray\C++\povray-3.7-stable\libraries\boost\boost/thread/win32/condition_variable.hpp(207):
note: Siehe Deklaration von
"boost::detail::basic_condition_variable::do_wait"
========== Erstellen: 9 erfolgreich, 11 fehlerhaft, 0 aktuell, 0
übersprungen ==========


Post a reply to this message

From: Sven Littkowski
Subject: Re: Blobs: Error1:NegativeValues:Holes!/Error2:AlphaValueOverwriting?
Date: 12 Jan 2016 12:34:05
Message: <5695390d@news.povray.org>
I clicked on DEBUG, and during the debugging, several warnings were
created. At the end, an error came up and the question if I want to
execute nonetheless the last build. I clicked YES. The file could not be
executed because something was missing.

How to proceed from here? Extracting all files again from the POV-Ray
Stable.ZIP (assuming VS changed many files) and making the blob change
again, this time not updating anything in VS? Was debugging the correct
command, or should I have used some other command?

Please advise. Big thanks. :-)


Here is the LOG FILE:
------------------------------------------------------------------

1>------ Erstellen gestartet: Projekt: eLut, Konfiguration: Release
Win32 ------
2>------ Erstellen gestartet: Projekt: toFloat, Konfiguration: Release
Win32 ------
2>  toFloat.cpp
1>  eLut.cpp
1>  openexr_eLut.vcxproj -> H:\- Setup\Applications\-
3D\POV-Ray\C++\povray-3.7-stable\windows\vs10\build\eLut\Win32\Release\eLut.exe
1>  openexr_eLut.vcxproj -> build\eLut\Win32\Release\eLut.pdb (Full PDB)
3>------ Erstellen gestartet: Projekt: tiff, Konfiguration: Debug Win32
------
2>  openexr_toFloat.vcxproj -> H:\- Setup\Applications\-
3D\POV-Ray\C++\povray-3.7-stable\windows\vs10\build\toFloat\Win32\Release\toFloat.exe
2>  openexr_toFloat.vcxproj -> build\toFloat\Win32\Release\toFloat.pdb
(Full PDB)
4>------ Erstellen gestartet: Projekt: Half, Konfiguration: Debug Win32
------
4>  half.cpp
4>H:\Program Files (x86)\Microsoft Visual Studio
14.0\VC\include\yvals.h(26): warning C4005: "_HAS_CPP0X":
Makro-Neudefinition
4>  H:\Program Files (x86)\Microsoft Visual Studio
14.0\VC\include\yvals.h(26): note: Befehlszeilenargumente: siehe
vorherige Definition von "_HAS_CPP0X"
3>
3>  Microsoft (R) Program Maintenance Utility, Version 14.00.23506.0
3>  Copyright (C) Microsoft Corporation. Alle Rechte vorbehalten.
3>
3>  	copy ..\..\libraries\tiff\libtiff\tif_config.h.vc
..\..\libraries\tiff\libtiff\tif_config.h
4>..\..\libraries\ilmbase\Half\half.cpp(63): fatal error C1083: Datei
(Include) kann nicht geöffnet werden: "toFloat.h": No such file or directory
5>------ Erstellen gestartet: Projekt: b44ExpLogTable, Konfiguration:
Debug Win32 ------
3>          1 file(s) copied.
3>  	copy ..\..\libraries\tiff\libtiff\tiffconf.h.vc
..\..\libraries\tiff\libtiff\tiffconf.h
3>          1 file(s) copied.
3>  tif_aux.c
3>  tif_close.c
3>  tif_codec.c
5>  b44ExpLogTable.cpp
3>  tif_color.c
5>LINK : fatal error LNK1104: Datei "H:\- Setup\Applications\-
3D\POV-Ray\C++\povray-3.7-stable\windows\vs10\bin32\lib\Half32d.lib"
kann nicht geöffnet werden.
6>------ Erstellen gestartet: Projekt: jpeg, Konfiguration: Debug Win32
------
3>  tif_compress.c
6>  jaricom.c
3>  tif_dir.c
6>  jcapimin.c
6>  jcapistd.c
3>  tif_dirinfo.c
6>  jcarith.c
6>  jccoefct.c
3>..\..\libraries\tiff\libtiff\tif_dirinfo.c(754): warning C4996:
'_lfind': The POSIX name for this item is deprecated. Instead, use the
ISO C and C++ conformant name: _lfind. See online help for details.
3>  C:\Program Files (x86)\Windows
Kits\10\Include\10.0.10240.0\ucrt\corecrt_search.h(71): note: Siehe
Deklaration von "_lfind"
3>  tif_dirread.c
6>  jccolor.c
6>  jcdctmgr.c
6>  jchuff.c
3>  tif_dirwrite.c
6>  jcinit.c
6>  jcmainct.c
3>  tif_dumpmode.c
6>  jcmarker.c
3>  tif_error.c
6>  jcmaster.c
6>  jcomapi.c
6>  jcparam.c
3>  tif_fax3.c
6>  jcprepct.c
6>  jcsample.c
6>  jctrans.c
6>  jdapimin.c
6>  jdapistd.c
3>  tif_fax3sm.c
6>  jdarith.c
6>  Code wird generiert...
3>  tif_flush.c
3>  tif_getimage.c
6>  Kompilieren...
6>  jdatadst.c
6>  jdatasrc.c
3>  tif_jpeg.c
3>..\..\libraries\tiff\libtiff\tif_jpeg.c(27): warning C4005:
"WIN32_LEAN_AND_MEAN": Makro-Neudefinition
3>  ..\..\libraries\tiff\libtiff\tif_jpeg.c(27): note:
Befehlszeilenargumente: siehe vorherige Definition von "WIN32_LEAN_AND_MEAN"
6>  jdcoefct.c
6>  jdcolor.c
3>  tif_luv.c
6>  jddctmgr.c
6>  jdhuff.c
6>  jdinput.c
6>  jdmainct.c
6>  jdmarker.c
3>  tif_lzw.c
6>  jdmaster.c
6>  jdmerge.c
6>  jdpostct.c
3>  tif_next.c
6>  jdsample.c
6>  jdtrans.c
3>  tif_open.c
6>  jerror.c
6>  jfdctflt.c
6>  jfdctfst.c
6>  jfdctint.c
3>  Code wird generiert...
6>  jidctflt.c
6>  jidctfst.c
6>  Code wird generiert...
3>  Kompilieren...
3>  tif_packbits.c
3>  tif_pixarlog.c
6>  Kompilieren...
6>  jidctint.c
6>  jmemmgr.c
3>  tif_predict.c
6>  jmemnobs.c
3>  tif_print.c
6>  jquant1.c
6>  jquant2.c
6>  jutils.c
3>  tif_read.c
6>  Code wird generiert...
3>  tif_strip.c
3>  tif_swab.c
6>  jpeg.vcxproj -> H:\- Setup\Applications\-
3D\POV-Ray\C++\povray-3.7-stable\windows\vs10\bin32\lib\jpeg32d.lib
3>  tif_thunder.c
3>  tif_tile.c
3>  tif_version.c
3>  tif_warning.c
3>  tif_win32.c
3>  tif_write.c
3>  tif_zip.c
7>------ Erstellen gestartet: Projekt: libpng, Konfiguration: Debug
Win32 ------
3>  Code wird generiert...
7>          1 file(s) copied.
7>  png.c
7>  pngerror.c
7>  pngget.c
7>  pngmem.c
7>  pngpread.c
7>  pngread.c
7>  pngrio.c
7>  pngrtran.c
7>  pngrutil.c
7>  pngset.c
7>  pngtrans.c
7>  pngwio.c
7>  pngwrite.c
7>  pngwtran.c
7>  pngwutil.c
7>  Code wird generiert...
3>  tiff.vcxproj -> H:\- Setup\Applications\-
3D\POV-Ray\C++\povray-3.7-stable\windows\vs10\bin32\lib\tiff32d.lib
8>------ Erstellen gestartet: Projekt: zlib, Konfiguration: Debug Win32
------
7>  libpng.vcxproj -> H:\- Setup\Applications\-
3D\POV-Ray\C++\povray-3.7-stable\windows\vs10\bin32\lib\libpng32d.lib
8>  adler32.c
8>  compress.c
8>  crc32.c
8>  deflate.c
8>  gzclose.c
8>  gzlib.c
8>..\..\libraries\zlib\gzlib.c(239): warning C4996: 'open': The POSIX
name for this item is deprecated. Instead, use the ISO C and C++
conformant name: _open. See online help for details.
8>  C:\Program Files (x86)\Windows
Kits\10\Include\10.0.10240.0\ucrt\corecrt_io.h(514): note: Siehe
Deklaration von "open"
8>  gzread.c
8>..\..\libraries\zlib\gzread.c(30): warning C4996: 'read': The POSIX
name for this item is deprecated. Instead, use the ISO C and C++
conformant name: _read. See online help for details.
8>  C:\Program Files (x86)\Windows
Kits\10\Include\10.0.10240.0\ucrt\corecrt_io.h(521): note: Siehe
Deklaration von "read"
8>..\..\libraries\zlib\gzread.c(586): warning C4996: 'close': The POSIX
name for this item is deprecated. Instead, use the ISO C and C++
conformant name: _close. See online help for details.
8>  C:\Program Files (x86)\Windows
Kits\10\Include\10.0.10240.0\ucrt\corecrt_io.h(457): note: Siehe
Deklaration von "close"
8>  gzwrite.c
8>..\..\libraries\zlib\gzwrite.c(84): warning C4996: 'write': The POSIX
name for this item is deprecated. Instead, use the ISO C and C++
conformant name: _write. See online help for details.
8>  C:\Program Files (x86)\Windows
Kits\10\Include\10.0.10240.0\ucrt\corecrt_io.h(556): note: Siehe
Deklaration von "write"
8>..\..\libraries\zlib\gzwrite.c(101): warning C4996: 'write': The POSIX
name for this item is deprecated. Instead, use the ISO C and C++
conformant name: _write. See online help for details.
8>  C:\Program Files (x86)\Windows
Kits\10\Include\10.0.10240.0\ucrt\corecrt_io.h(556): note: Siehe
Deklaration von "write"
8>..\..\libraries\zlib\gzwrite.c(561): warning C4996: 'close': The POSIX
name for this item is deprecated. Instead, use the ISO C and C++
conformant name: _close. See online help for details.
8>  C:\Program Files (x86)\Windows
Kits\10\Include\10.0.10240.0\ucrt\corecrt_io.h(457): note: Siehe
Deklaration von "close"
8>  infback.c
8>  inffast.c
8>  inflate.c
8>  inftrees.c
8>  trees.c
8>  uncompr.c
8>  zutil.c
8>  Code wird generiert...
8>  zlib.vcxproj -> H:\- Setup\Applications\-
3D\POV-Ray\C++\povray-3.7-stable\windows\vs10\bin32\lib\zlib32d.lib
9>------ Erstellen gestartet: Projekt: vfewin, Konfiguration: Debug
Win32 ------
9>  vfeprecomp.cpp
9>H:\Program Files (x86)\Microsoft Visual Studio
14.0\VC\include\yvals.h(26): warning C4005: "_HAS_CPP0X":
Makro-Neudefinition
9>  H:\Program Files (x86)\Microsoft Visual Studio
14.0\VC\include\yvals.h(26): note: Befehlszeilenargumente: siehe
vorherige Definition von "_HAS_CPP0X"
9>  Unknown compiler version - please run the configure tests and report
the results
9>H:\- Setup\Applications\-
3D\POV-Ray\C++\povray-3.7-stable\libraries\boost\boost/thread/xtime.hpp(23):
error C2059: Syntaxfehler: "Konstante"
9>H:\- Setup\Applications\-
3D\POV-Ray\C++\povray-3.7-stable\libraries\boost\boost/thread/xtime.hpp(31):
error C2143: Syntaxfehler: Es fehlt ";" vor "}"
9>H:\- Setup\Applications\-
3D\POV-Ray\C++\povray-3.7-stable\libraries\boost\boost/thread/xtime.hpp(46):
error C2833: Operator "system_time" ist kein bekannter Operator oder Typ
9>H:\- Setup\Applications\-
3D\POV-Ray\C++\povray-3.7-stable\libraries\boost\boost/thread/xtime.hpp(46):
error C2059: Syntaxfehler: "newline"
9>H:\- Setup\Applications\-
3D\POV-Ray\C++\povray-3.7-stable\libraries\boost\boost/thread/xtime.hpp(47):
error C2334: Unerwartete(s) Token vor "{"; sichtbarer Funktionstext wird
übersprungen
9>H:\- Setup\Applications\-
3D\POV-Ray\C++\povray-3.7-stable\libraries\boost\boost/thread/xtime.hpp(73):
error C3861: "get_system_time": Bezeichner wurde nicht gefunden.
9>H:\- Setup\Applications\-
3D\POV-Ray\C++\povray-3.7-stable\libraries\boost\boost/thread/xtime.hpp(88):
error C2059: Syntaxfehler: "}"
9>H:\- Setup\Applications\-
3D\POV-Ray\C++\povray-3.7-stable\libraries\boost\boost/thread/xtime.hpp(88):
error C2143: Syntaxfehler: Es fehlt ";" vor "}"
9>h:\- setup\applications\-
3d\pov-ray\c++\povray-3.7-stable\libraries\boost\boost\thread\win32\basic_timed_mutex.hpp(22):
error C2143: Syntaxfehler: Es fehlt ";" vor "{"
9>h:\- setup\applications\-
3d\pov-ray\c++\povray-3.7-stable\libraries\boost\boost\thread\win32\basic_timed_mutex.hpp(22):
error C2447: "{": Funktionsheader fehlt - Parameterliste im alten Stil?
9>H:\- Setup\Applications\-
3D\POV-Ray\C++\povray-3.7-stable\libraries\boost\boost/thread/win32/mutex.hpp(19):
error C2039: "basic_timed_mutex": Ist kein Element von "boost::detail"
9>  H:\- Setup\Applications\-
3D\POV-Ray\C++\povray-3.7-stable\libraries\boost\boost/thread/win32/mutex.hpp(17):
note: Siehe Deklaration von "boost::detail"
9>H:\- Setup\Applications\-
3D\POV-Ray\C++\povray-3.7-stable\libraries\boost\boost/thread/win32/mutex.hpp(19):
error C4430: Fehlender Typspezifizierer - int wird angenommen. Hinweis:
"default-int" wird von C++ nicht unterstützt.
9>H:\- Setup\Applications\-
3D\POV-Ray\C++\povray-3.7-stable\libraries\boost\boost/thread/win32/mutex.hpp(19):
error C2146: Syntaxfehler: Fehlendes ";" vor Bezeichner "underlying_mutex"
9>H:\- Setup\Applications\-
3D\POV-Ray\C++\povray-3.7-stable\libraries\boost\boost/thread/win32/mutex.hpp(24):
error C2039: "underlying_mutex": Ist kein Element von "boost::detail"
9>  H:\- Setup\Applications\-
3D\POV-Ray\C++\povray-3.7-stable\libraries\boost\boost/thread/win32/mutex.hpp(17):
note: Siehe Deklaration von "boost::detail"
9>H:\- Setup\Applications\-
3D\POV-Ray\C++\povray-3.7-stable\libraries\boost\boost/thread/win32/mutex.hpp(24):
error C2504: "underlying_mutex": Basisklasse undefiniert
9>H:\- Setup\Applications\-
3D\POV-Ray\C++\povray-3.7-stable\libraries\boost\boost/thread/win32/mutex.hpp(31):
error C3861: "initialize": Bezeichner wurde nicht gefunden.
9>H:\- Setup\Applications\-
3D\POV-Ray\C++\povray-3.7-stable\libraries\boost\boost/thread/win32/mutex.hpp(35):
error C3861: "destroy": Bezeichner wurde nicht gefunden.
9>H:\- Setup\Applications\-
3D\POV-Ray\C++\povray-3.7-stable\libraries\boost\boost/thread/win32/mutex.hpp(46):
error C2516: "boost::detail::basic_timed_mutex": Keine zulässige Basisklasse
9>  H:\- Setup\Applications\-
3D\POV-Ray\C++\povray-3.7-stable\libraries\boost\boost/thread/win32/mutex.hpp(19):
note: Siehe Deklaration von "boost::detail::basic_timed_mutex"
9>H:\- Setup\Applications\-
3D\POV-Ray\C++\povray-3.7-stable\libraries\boost\boost/thread/win32/mutex.hpp(53):
error C3861: "initialize": Bezeichner wurde nicht gefunden.
9>H:\- Setup\Applications\-
3D\POV-Ray\C++\povray-3.7-stable\libraries\boost\boost/thread/win32/mutex.hpp(58):
error C3861: "destroy": Bezeichner wurde nicht gefunden.
9>H:\- Setup\Applications\-
3D\POV-Ray\C++\povray-3.7-stable\libraries\boost\boost/thread/detail/thread.hpp(385):
error C2440: "<function-style-cast>": "const boost::xtime" kann nicht in
"boost::system_time" konvertiert werden
9>  H:\- Setup\Applications\-
3D\POV-Ray\C++\povray-3.7-stable\libraries\boost\boost/thread/detail/thread.hpp(385):
note: Quelltyp konnte von keinem Konstruktor angenommen werden, oder die
Überladungsauflösung des Konstruktors ist mehrdeutig
9>H:\- Setup\Applications\-
3D\POV-Ray\C++\povray-3.7-stable\libraries\boost\boost/thread/win32/condition_variable.hpp(327):
error C2440: "<function-style-cast>": "const boost::xtime" kann nicht in
"boost::system_time" konvertiert werden
9>  H:\- Setup\Applications\-
3D\POV-Ray\C++\povray-3.7-stable\libraries\boost\boost/thread/win32/condition_variable.hpp(327):
note: Quelltyp konnte von keinem Konstruktor angenommen werden, oder die
Überladungsauflösung des Konstruktors ist mehrdeutig
9>H:\- Setup\Applications\-
3D\POV-Ray\C++\povray-3.7-stable\libraries\boost\boost/thread/win32/condition_variable.hpp(327):
error C2672: "boost::detail::basic_condition_variable::do_wait": keine
übereinstimmende überladene Funktion gefunden
9>H:\- Setup\Applications\-
3D\POV-Ray\C++\povray-3.7-stable\libraries\boost\boost/thread/win32/condition_variable.hpp(327):
error C2780: "bool
boost::detail::basic_condition_variable::do_wait(lock_type &,const
boost::detail::timeout &,predicate_type)": Erwartet 3 Argumente - 1
unterstützt
9>  H:\- Setup\Applications\-
3D\POV-Ray\C++\povray-3.7-stable\libraries\boost\boost/thread/win32/condition_variable.hpp(229):
note: Siehe Deklaration von
"boost::detail::basic_condition_variable::do_wait"
9>H:\- Setup\Applications\-
3D\POV-Ray\C++\povray-3.7-stable\libraries\boost\boost/thread/win32/condition_variable.hpp(327):
error C2780: "bool
boost::detail::basic_condition_variable::do_wait(lock_type
&,boost::detail::timeout)": Erwartet 2 Argumente - 1 unterstützt
9>  H:\- Setup\Applications\-
3D\POV-Ray\C++\povray-3.7-stable\libraries\boost\boost/thread/win32/condition_variable.hpp(207):
note: Siehe Deklaration von
"boost::detail::basic_condition_variable::do_wait"
10>------ Erstellen gestartet: Projekt: rtrsupport, Konfiguration: Debug
Win32 ------
11>------ Erstellen gestartet: Projekt: povbackend, Konfiguration: Debug
Win32 ------
11>  precomp.cpp
11>H:\Program Files (x86)\Microsoft Visual Studio
14.0\VC\include\yvals.h(26): warning C4005: "_HAS_CPP0X":
Makro-Neudefinition
11>  H:\Program Files (x86)\Microsoft Visual Studio
14.0\VC\include\yvals.h(26): note: Befehlszeilenargumente: siehe
vorherige Definition von "_HAS_CPP0X"
11>  Unknown compiler version - please run the configure tests and
report the results
11>H:\- Setup\Applications\-
3D\POV-Ray\C++\povray-3.7-stable\libraries\boost\boost/thread/xtime.hpp(23):
error C2059: Syntaxfehler: "Konstante"
11>H:\- Setup\Applications\-
3D\POV-Ray\C++\povray-3.7-stable\libraries\boost\boost/thread/xtime.hpp(31):
error C2143: Syntaxfehler: Es fehlt ";" vor "}"
11>H:\- Setup\Applications\-
3D\POV-Ray\C++\povray-3.7-stable\libraries\boost\boost/thread/xtime.hpp(46):
error C2833: Operator "system_time" ist kein bekannter Operator oder Typ
11>H:\- Setup\Applications\-
3D\POV-Ray\C++\povray-3.7-stable\libraries\boost\boost/thread/xtime.hpp(46):
error C2059: Syntaxfehler: "newline"
11>H:\- Setup\Applications\-
3D\POV-Ray\C++\povray-3.7-stable\libraries\boost\boost/thread/xtime.hpp(47):
error C2334: Unerwartete(s) Token vor "{"; sichtbarer Funktionstext wird
übersprungen
11>H:\- Setup\Applications\-
3D\POV-Ray\C++\povray-3.7-stable\libraries\boost\boost/thread/xtime.hpp(73):
error C3861: "get_system_time": Bezeichner wurde nicht gefunden.
11>H:\- Setup\Applications\-
3D\POV-Ray\C++\povray-3.7-stable\libraries\boost\boost/thread/xtime.hpp(88):
error C2059: Syntaxfehler: "}"
11>H:\- Setup\Applications\-
3D\POV-Ray\C++\povray-3.7-stable\libraries\boost\boost/thread/xtime.hpp(88):
error C2143: Syntaxfehler: Es fehlt ";" vor "}"
11>h:\- setup\applications\-
3d\pov-ray\c++\povray-3.7-stable\libraries\boost\boost\thread\win32\basic_timed_mutex.hpp(22):
error C2143: Syntaxfehler: Es fehlt ";" vor "{"
11>h:\- setup\applications\-
3d\pov-ray\c++\povray-3.7-stable\libraries\boost\boost\thread\win32\basic_timed_mutex.hpp(22):
error C2447: "{": Funktionsheader fehlt - Parameterliste im alten Stil?
11>H:\- Setup\Applications\-
3D\POV-Ray\C++\povray-3.7-stable\libraries\boost\boost/thread/win32/mutex.hpp(19):
error C2039: "basic_timed_mutex": Ist kein Element von "boost::detail"
11>  H:\- Setup\Applications\-
3D\POV-Ray\C++\povray-3.7-stable\libraries\boost\boost/thread/win32/mutex.hpp(17):
note: Siehe Deklaration von "boost::detail"
11>H:\- Setup\Applications\-
3D\POV-Ray\C++\povray-3.7-stable\libraries\boost\boost/thread/win32/mutex.hpp(19):
error C4430: Fehlender Typspezifizierer - int wird angenommen. Hinweis:
"default-int" wird von C++ nicht unterstützt.
11>H:\- Setup\Applications\-
3D\POV-Ray\C++\povray-3.7-stable\libraries\boost\boost/thread/win32/mutex.hpp(19):
error C2146: Syntaxfehler: Fehlendes ";" vor Bezeichner "underlying_mutex"
11>H:\- Setup\Applications\-
3D\POV-Ray\C++\povray-3.7-stable\libraries\boost\boost/thread/win32/mutex.hpp(24):
error C2039: "underlying_mutex": Ist kein Element von "boost::detail"
11>  H:\- Setup\Applications\-
3D\POV-Ray\C++\povray-3.7-stable\libraries\boost\boost/thread/win32/mutex.hpp(17):
note: Siehe Deklaration von "boost::detail"
11>H:\- Setup\Applications\-
3D\POV-Ray\C++\povray-3.7-stable\libraries\boost\boost/thread/win32/mutex.hpp(24):
error C2504: "underlying_mutex": Basisklasse undefiniert
11>H:\- Setup\Applications\-
3D\POV-Ray\C++\povray-3.7-stable\libraries\boost\boost/thread/win32/mutex.hpp(31):
error C3861: "initialize": Bezeichner wurde nicht gefunden.
11>H:\- Setup\Applications\-
3D\POV-Ray\C++\povray-3.7-stable\libraries\boost\boost/thread/win32/mutex.hpp(35):
error C3861: "destroy": Bezeichner wurde nicht gefunden.
11>H:\- Setup\Applications\-
3D\POV-Ray\C++\povray-3.7-stable\libraries\boost\boost/thread/win32/mutex.hpp(46):
error C2516: "boost::detail::basic_timed_mutex": Keine zulässige Basisklasse
11>  H:\- Setup\Applications\-
3D\POV-Ray\C++\povray-3.7-stable\libraries\boost\boost/thread/win32/mutex.hpp(19):
note: Siehe Deklaration von "boost::detail::basic_timed_mutex"
11>H:\- Setup\Applications\-
3D\POV-Ray\C++\povray-3.7-stable\libraries\boost\boost/thread/win32/mutex.hpp(53):
error C3861: "initialize": Bezeichner wurde nicht gefunden.
11>H:\- Setup\Applications\-
3D\POV-Ray\C++\povray-3.7-stable\libraries\boost\boost/thread/win32/mutex.hpp(58):
error C3861: "destroy": Bezeichner wurde nicht gefunden.
11>H:\- Setup\Applications\-
3D\POV-Ray\C++\povray-3.7-stable\libraries\boost\boost/thread/detail/thread.hpp(385):
error C2440: "<function-style-cast>": "const boost::xtime" kann nicht in
"boost::system_time" konvertiert werden
11>  H:\- Setup\Applications\-
3D\POV-Ray\C++\povray-3.7-stable\libraries\boost\boost/thread/detail/thread.hpp(385):
note: Quelltyp konnte von keinem Konstruktor angenommen werden, oder die
Überladungsauflösung des Konstruktors ist mehrdeutig
11>H:\- Setup\Applications\-
3D\POV-Ray\C++\povray-3.7-stable\libraries\boost\boost/thread/win32/condition_variable.hpp(327):
error C2440: "<function-style-cast>": "const boost::xtime" kann nicht in
"boost::system_time" konvertiert werden
11>  H:\- Setup\Applications\-
3D\POV-Ray\C++\povray-3.7-stable\libraries\boost\boost/thread/win32/condition_variable.hpp(327):
note: Quelltyp konnte von keinem Konstruktor angenommen werden, oder die
Überladungsauflösung des Konstruktors ist mehrdeutig
11>H:\- Setup\Applications\-
3D\POV-Ray\C++\povray-3.7-stable\libraries\boost\boost/thread/win32/condition_variable.hpp(327):
error C2672: "boost::detail::basic_condition_variable::do_wait": keine
übereinstimmende überladene Funktion gefunden
11>H:\- Setup\Applications\-
3D\POV-Ray\C++\povray-3.7-stable\libraries\boost\boost/thread/win32/condition_variable.hpp(327):
error C2780: "bool
boost::detail::basic_condition_variable::do_wait(lock_type &,const
boost::detail::timeout &,predicate_type)": Erwartet 3 Argumente - 1
unterstützt
11>  H:\- Setup\Applications\-
3D\POV-Ray\C++\povray-3.7-stable\libraries\boost\boost/thread/win32/condition_variable.hpp(229):
note: Siehe Deklaration von
"boost::detail::basic_condition_variable::do_wait"
11>H:\- Setup\Applications\-
3D\POV-Ray\C++\povray-3.7-stable\libraries\boost\boost/thread/win32/condition_variable.hpp(327):
error C2780: "bool
boost::detail::basic_condition_variable::do_wait(lock_type
&,boost::detail::timeout)": Erwartet 2 Argumente - 1 unterstützt
11>  H:\- Setup\Applications\-
3D\POV-Ray\C++\povray-3.7-stable\libraries\boost\boost/thread/win32/condition_variable.hpp(207):
note: Siehe Deklaration von
"boost::detail::basic_condition_variable::do_wait"
10>  vidcapimpl.cpp
10>H:\Program Files (x86)\Microsoft Visual Studio
14.0\VC\include\yvals.h(26): warning C4005: "_HAS_CPP0X":
Makro-Neudefinition
10>  H:\Program Files (x86)\Microsoft Visual Studio
14.0\VC\include\yvals.h(26): note: Befehlszeilenargumente: siehe
vorherige Definition von "_HAS_CPP0X"
10>  Unknown compiler version - please run the configure tests and
report the results
10>h:\- setup\applications\-
3d\pov-ray\c++\povray-3.7-stable\vfe\win\compilers/msvc.h(106): fatal
error C1189: #error:  Please update msvc.h to include this version of MSVC
10>  vidcap.cpp
10>H:\Program Files (x86)\Microsoft Visual Studio
14.0\VC\include\yvals.h(26): warning C4005: "_HAS_CPP0X":
Makro-Neudefinition
10>  H:\Program Files (x86)\Microsoft Visual Studio
14.0\VC\include\yvals.h(26): note: Befehlszeilenargumente: siehe
vorherige Definition von "_HAS_CPP0X"
10>  Unknown compiler version - please run the configure tests and
report the results
10>h:\- setup\applications\-
3d\pov-ray\c++\povray-3.7-stable\vfe\win\compilers/msvc.h(106): fatal
error C1189: #error:  Please update msvc.h to include this version of MSVC
10>  rtrsupport.cpp
12>------ Erstellen gestartet: Projekt: povbase, Konfiguration: Debug
Win32 ------
10>H:\Program Files (x86)\Microsoft Visual Studio
14.0\VC\include\yvals.h(26): warning C4005: "_HAS_CPP0X":
Makro-Neudefinition
10>  H:\Program Files (x86)\Microsoft Visual Studio
14.0\VC\include\yvals.h(26): note: Befehlszeilenargumente: siehe
vorherige Definition von "_HAS_CPP0X"
12>  precomp.cpp
12>H:\Program Files (x86)\Microsoft Visual Studio
14.0\VC\include\yvals.h(26): warning C4005: "_HAS_CPP0X":
Makro-Neudefinition
10>  Unknown compiler version - please run the configure tests and
report the results
12>  H:\Program Files (x86)\Microsoft Visual Studio
14.0\VC\include\yvals.h(26): note: Befehlszeilenargumente: siehe
vorherige Definition von "_HAS_CPP0X"
10>h:\- setup\applications\-
3d\pov-ray\c++\povray-3.7-stable\vfe\win\compilers/msvc.h(106): fatal
error C1189: #error:  Please update msvc.h to include this version of MSVC
10>  Code wird generiert...
13>------ Erstellen gestartet: Projekt: povfrontend, Konfiguration:
Debug Win32 ------
12>  Unknown compiler version - please run the configure tests and
report the results
13>  precomp.cpp
13>H:\Program Files (x86)\Microsoft Visual Studio
14.0\VC\include\yvals.h(26): warning C4005: "_HAS_CPP0X":
Makro-Neudefinition
13>  H:\Program Files (x86)\Microsoft Visual Studio
14.0\VC\include\yvals.h(26): note: Befehlszeilenargumente: siehe
vorherige Definition von "_HAS_CPP0X"
13>  Unknown compiler version - please run the configure tests and
report the results
12>H:\- Setup\Applications\-
3D\POV-Ray\C++\povray-3.7-stable\libraries\boost\boost/thread/xtime.hpp(23):
error C2059: Syntaxfehler: "Konstante"
12>H:\- Setup\Applications\-
3D\POV-Ray\C++\povray-3.7-stable\libraries\boost\boost/thread/xtime.hpp(31):
error C2143: Syntaxfehler: Es fehlt ";" vor "}"
12>H:\- Setup\Applications\-
3D\POV-Ray\C++\povray-3.7-stable\libraries\boost\boost/thread/xtime.hpp(46):
error C2833: Operator "system_time" ist kein bekannter Operator oder Typ
12>H:\- Setup\Applications\-
3D\POV-Ray\C++\povray-3.7-stable\libraries\boost\boost/thread/xtime.hpp(46):
error C2059: Syntaxfehler: "newline"
12>H:\- Setup\Applications\-
3D\POV-Ray\C++\povray-3.7-stable\libraries\boost\boost/thread/xtime.hpp(47):
error C2334: Unerwartete(s) Token vor "{"; sichtbarer Funktionstext wird
übersprungen
12>H:\- Setup\Applications\-
3D\POV-Ray\C++\povray-3.7-stable\libraries\boost\boost/thread/xtime.hpp(73):
error C3861: "get_system_time": Bezeichner wurde nicht gefunden.
12>H:\- Setup\Applications\-
3D\POV-Ray\C++\povray-3.7-stable\libraries\boost\boost/thread/xtime.hpp(88):
error C2059: Syntaxfehler: "}"
12>H:\- Setup\Applications\-
3D\POV-Ray\C++\povray-3.7-stable\libraries\boost\boost/thread/xtime.hpp(88):
error C2143: Syntaxfehler: Es fehlt ";" vor "}"
12>h:\- setup\applications\-
3d\pov-ray\c++\povray-3.7-stable\libraries\boost\boost\thread\win32\basic_timed_mutex.hpp(22):
error C2143: Syntaxfehler: Es fehlt ";" vor "{"
12>h:\- setup\applications\-
3d\pov-ray\c++\povray-3.7-stable\libraries\boost\boost\thread\win32\basic_timed_mutex.hpp(22):
error C2447: "{": Funktionsheader fehlt - Parameterliste im alten Stil?
12>H:\- Setup\Applications\-
3D\POV-Ray\C++\povray-3.7-stable\libraries\boost\boost/thread/win32/mutex.hpp(19):
error C2039: "basic_timed_mutex": Ist kein Element von "boost::detail"
12>  H:\- Setup\Applications\-
3D\POV-Ray\C++\povray-3.7-stable\libraries\boost\boost/thread/win32/mutex.hpp(17):
note: Siehe Deklaration von "boost::detail"
12>H:\- Setup\Applications\-
3D\POV-Ray\C++\povray-3.7-stable\libraries\boost\boost/thread/win32/mutex.hpp(19):
error C4430: Fehlender Typspezifizierer - int wird angenommen. Hinweis:
"default-int" wird von C++ nicht unterstützt.
12>H:\- Setup\Applications\-
3D\POV-Ray\C++\povray-3.7-stable\libraries\boost\boost/thread/win32/mutex.hpp(19):
error C2146: Syntaxfehler: Fehlendes ";" vor Bezeichner "underlying_mutex"
12>H:\- Setup\Applications\-
3D\POV-Ray\C++\povray-3.7-stable\libraries\boost\boost/thread/win32/mutex.hpp(24):
error C2039: "underlying_mutex": Ist kein Element von "boost::detail"
12>  H:\- Setup\Applications\-
3D\POV-Ray\C++\povray-3.7-stable\libraries\boost\boost/thread/win32/mutex.hpp(17):
note: Siehe Deklaration von "boost::detail"
12>H:\- Setup\Applications\-
3D\POV-Ray\C++\povray-3.7-stable\libraries\boost\boost/thread/win32/mutex.hpp(24):
error C2504: "underlying_mutex": Basisklasse undefiniert
12>H:\- Setup\Applications\-
3D\POV-Ray\C++\povray-3.7-stable\libraries\boost\boost/thread/win32/mutex.hpp(31):
error C3861: "initialize": Bezeichner wurde nicht gefunden.
12>H:\- Setup\Applications\-
3D\POV-Ray\C++\povray-3.7-stable\libraries\boost\boost/thread/win32/mutex.hpp(35):
error C3861: "destroy": Bezeichner wurde nicht gefunden.
12>H:\- Setup\Applications\-
3D\POV-Ray\C++\povray-3.7-stable\libraries\boost\boost/thread/win32/mutex.hpp(46):
error C2516: "boost::detail::basic_timed_mutex": Keine zulässige Basisklasse
12>  H:\- Setup\Applications\-
3D\POV-Ray\C++\povray-3.7-stable\libraries\boost\boost/thread/win32/mutex.hpp(19):
note: Siehe Deklaration von "boost::detail::basic_timed_mutex"
12>H:\- Setup\Applications\-
3D\POV-Ray\C++\povray-3.7-stable\libraries\boost\boost/thread/win32/mutex.hpp(53):
error C3861: "initialize": Bezeichner wurde nicht gefunden.
12>H:\- Setup\Applications\-
3D\POV-Ray\C++\povray-3.7-stable\libraries\boost\boost/thread/win32/mutex.hpp(58):
error C3861: "destroy": Bezeichner wurde nicht gefunden.
12>H:\- Setup\Applications\-
3D\POV-Ray\C++\povray-3.7-stable\libraries\boost\boost/thread/detail/thread.hpp(385):
error C2440: "<function-style-cast>": "const boost::xtime" kann nicht in
"boost::system_time" konvertiert werden
12>  H:\- Setup\Applications\-
3D\POV-Ray\C++\povray-3.7-stable\libraries\boost\boost/thread/detail/thread.hpp(385):
note: Quelltyp konnte von keinem Konstruktor angenommen werden, oder die
Überladungsauflösung des Konstruktors ist mehrdeutig
12>H:\- Setup\Applications\-
3D\POV-Ray\C++\povray-3.7-stable\libraries\boost\boost/thread/win32/condition_variable.hpp(327):
error C2440: "<function-style-cast>": "const boost::xtime" kann nicht in
"boost::system_time" konvertiert werden
12>  H:\- Setup\Applications\-
3D\POV-Ray\C++\povray-3.7-stable\libraries\boost\boost/thread/win32/condition_variable.hpp(327):
note: Quelltyp konnte von keinem Konstruktor angenommen werden, oder die
Überladungsauflösung des Konstruktors ist mehrdeutig
12>H:\- Setup\Applications\-
3D\POV-Ray\C++\povray-3.7-stable\libraries\boost\boost/thread/win32/condition_variable.hpp(327):
error C2672: "boost::detail::basic_condition_variable::do_wait": keine
übereinstimmende überladene Funktion gefunden
12>H:\- Setup\Applications\-
3D\POV-Ray\C++\povray-3.7-stable\libraries\boost\boost/thread/win32/condition_variable.hpp(327):
error C2780: "bool
boost::detail::basic_condition_variable::do_wait(lock_type &,const
boost::detail::timeout &,predicate_type)": Erwartet 3 Argumente - 1
unterstützt
12>  H:\- Setup\Applications\-
3D\POV-Ray\C++\povray-3.7-stable\libraries\boost\boost/thread/win32/condition_variable.hpp(229):
note: Siehe Deklaration von
"boost::detail::basic_condition_variable::do_wait"
12>H:\- Setup\Applications\-
3D\POV-Ray\C++\povray-3.7-stable\libraries\boost\boost/thread/win32/condition_variable.hpp(327):
error C2780: "bool
boost::detail::basic_condition_variable::do_wait(lock_type
&,boost::detail::timeout)": Erwartet 2 Argumente - 1 unterstützt
12>  H:\- Setup\Applications\-
3D\POV-Ray\C++\povray-3.7-stable\libraries\boost\boost/thread/win32/condition_variable.hpp(207):
note: Siehe Deklaration von
"boost::detail::basic_condition_variable::do_wait"
13>H:\- Setup\Applications\-
3D\POV-Ray\C++\povray-3.7-stable\libraries\boost\boost/thread/xtime.hpp(23):
error C2059: Syntaxfehler: "Konstante"
13>H:\- Setup\Applications\-
3D\POV-Ray\C++\povray-3.7-stable\libraries\boost\boost/thread/xtime.hpp(31):
error C2143: Syntaxfehler: Es fehlt ";" vor "}"
13>H:\- Setup\Applications\-
3D\POV-Ray\C++\povray-3.7-stable\libraries\boost\boost/thread/xtime.hpp(46):
error C2833: Operator "system_time" ist kein bekannter Operator oder Typ
13>H:\- Setup\Applications\-
3D\POV-Ray\C++\povray-3.7-stable\libraries\boost\boost/thread/xtime.hpp(46):
error C2059: Syntaxfehler: "newline"
13>H:\- Setup\Applications\-
3D\POV-Ray\C++\povray-3.7-stable\libraries\boost\boost/thread/xtime.hpp(47):
error C2334: Unerwartete(s) Token vor "{"; sichtbarer Funktionstext wird
übersprungen
13>H:\- Setup\Applications\-
3D\POV-Ray\C++\povray-3.7-stable\libraries\boost\boost/thread/xtime.hpp(73):
error C3861: "get_system_time": Bezeichner wurde nicht gefunden.
13>H:\- Setup\Applications\-
3D\POV-Ray\C++\povray-3.7-stable\libraries\boost\boost/thread/xtime.hpp(88):
error C2059: Syntaxfehler: "}"
13>H:\- Setup\Applications\-
3D\POV-Ray\C++\povray-3.7-stable\libraries\boost\boost/thread/xtime.hpp(88):
error C2143: Syntaxfehler: Es fehlt ";" vor "}"
13>h:\- setup\applications\-
3d\pov-ray\c++\povray-3.7-stable\libraries\boost\boost\thread\win32\basic_timed_mutex.hpp(22):
error C2143: Syntaxfehler: Es fehlt ";" vor "{"
13>h:\- setup\applications\-
3d\pov-ray\c++\povray-3.7-stable\libraries\boost\boost\thread\win32\basic_timed_mutex.hpp(22):
error C2447: "{": Funktionsheader fehlt - Parameterliste im alten Stil?
13>H:\- Setup\Applications\-
3D\POV-Ray\C++\povray-3.7-stable\libraries\boost\boost/thread/win32/mutex.hpp(19):
error C2039: "basic_timed_mutex": Ist kein Element von "boost::detail"
13>  H:\- Setup\Applications\-
3D\POV-Ray\C++\povray-3.7-stable\libraries\boost\boost/thread/win32/mutex.hpp(17):
note: Siehe Deklaration von "boost::detail"
13>H:\- Setup\Applications\-
3D\POV-Ray\C++\povray-3.7-stable\libraries\boost\boost/thread/win32/mutex.hpp(19):
error C4430: Fehlender Typspezifizierer - int wird angenommen. Hinweis:
"default-int" wird von C++ nicht unterstützt.
13>H:\- Setup\Applications\-
3D\POV-Ray\C++\povray-3.7-stable\libraries\boost\boost/thread/win32/mutex.hpp(19):
error C2146: Syntaxfehler: Fehlendes ";" vor Bezeichner "underlying_mutex"
13>H:\- Setup\Applications\-
3D\POV-Ray\C++\povray-3.7-stable\libraries\boost\boost/thread/win32/mutex.hpp(24):
error C2039: "underlying_mutex": Ist kein Element von "boost::detail"
13>  H:\- Setup\Applications\-
3D\POV-Ray\C++\povray-3.7-stable\libraries\boost\boost/thread/win32/mutex.hpp(17):
note: Siehe Deklaration von "boost::detail"
13>H:\- Setup\Applications\-
3D\POV-Ray\C++\povray-3.7-stable\libraries\boost\boost/thread/win32/mutex.hpp(24):
error C2504: "underlying_mutex": Basisklasse undefiniert
13>H:\- Setup\Applications\-
3D\POV-Ray\C++\povray-3.7-stable\libraries\boost\boost/thread/win32/mutex.hpp(31):
error C3861: "initialize": Bezeichner wurde nicht gefunden.
13>H:\- Setup\Applications\-
3D\POV-Ray\C++\povray-3.7-stable\libraries\boost\boost/thread/win32/mutex.hpp(35):
error C3861: "destroy": Bezeichner wurde nicht gefunden.
13>H:\- Setup\Applications\-
3D\POV-Ray\C++\povray-3.7-stable\libraries\boost\boost/thread/win32/mutex.hpp(46):
error C2516: "boost::detail::basic_timed_mutex": Keine zulässige Basisklasse
13>  H:\- Setup\Applications\-
3D\POV-Ray\C++\povray-3.7-stable\libraries\boost\boost/thread/win32/mutex.hpp(19):
note: Siehe Deklaration von "boost::detail::basic_timed_mutex"
13>H:\- Setup\Applications\-
3D\POV-Ray\C++\povray-3.7-stable\libraries\boost\boost/thread/win32/mutex.hpp(53):
error C3861: "initialize": Bezeichner wurde nicht gefunden.
13>H:\- Setup\Applications\-
3D\POV-Ray\C++\povray-3.7-stable\libraries\boost\boost/thread/win32/mutex.hpp(58):
error C3861: "destroy": Bezeichner wurde nicht gefunden.
13>H:\- Setup\Applications\-
3D\POV-Ray\C++\povray-3.7-stable\libraries\boost\boost/thread/detail/thread.hpp(385):
error C2440: "<function-style-cast>": "const boost::xtime" kann nicht in
"boost::system_time" konvertiert werden
13>  H:\- Setup\Applications\-
3D\POV-Ray\C++\povray-3.7-stable\libraries\boost\boost/thread/detail/thread.hpp(385):
note: Quelltyp konnte von keinem Konstruktor angenommen werden, oder die
Überladungsauflösung des Konstruktors ist mehrdeutig
13>H:\- Setup\Applications\-
3D\POV-Ray\C++\povray-3.7-stable\libraries\boost\boost/thread/win32/condition_variable.hpp(327):
error C2440: "<function-style-cast>": "const boost::xtime" kann nicht in
"boost::system_time" konvertiert werden
13>  H:\- Setup\Applications\-
3D\POV-Ray\C++\povray-3.7-stable\libraries\boost\boost/thread/win32/condition_variable.hpp(327):
note: Quelltyp konnte von keinem Konstruktor angenommen werden, oder die
Überladungsauflösung des Konstruktors ist mehrdeutig
13>H:\- Setup\Applications\-
3D\POV-Ray\C++\povray-3.7-stable\libraries\boost\boost/thread/win32/condition_variable.hpp(327):
error C2672: "boost::detail::basic_condition_variable::do_wait": keine
übereinstimmende überladene Funktion gefunden
13>H:\- Setup\Applications\-
3D\POV-Ray\C++\povray-3.7-stable\libraries\boost\boost/thread/win32/condition_variable.hpp(327):
error C2780: "bool
boost::detail::basic_condition_variable::do_wait(lock_type &,const
boost::detail::timeout &,predicate_type)": Erwartet 3 Argumente - 1
unterstützt
13>  H:\- Setup\Applications\-
3D\POV-Ray\C++\povray-3.7-stable\libraries\boost\boost/thread/win32/condition_variable.hpp(229):
note: Siehe Deklaration von
"boost::detail::basic_condition_variable::do_wait"
13>H:\- Setup\Applications\-
3D\POV-Ray\C++\povray-3.7-stable\libraries\boost\boost/thread/win32/condition_variable.hpp(327):
error C2780: "bool
boost::detail::basic_condition_variable::do_wait(lock_type
&,boost::detail::timeout)": Erwartet 2 Argumente - 1 unterstützt
13>  H:\- Setup\Applications\-
3D\POV-Ray\C++\povray-3.7-stable\libraries\boost\boost/thread/win32/condition_variable.hpp(207):
note: Siehe Deklaration von
"boost::detail::basic_condition_variable::do_wait"
14>------ Erstellen gestartet: Projekt: boost_thread, Konfiguration:
Debug Win32 ------
15>------ Erstellen gestartet: Projekt: boost_date_time, Konfiguration:
Debug Win32 ------
15>  greg_weekday.cpp
14>  tss_pe.cpp
14>  Unknown compiler version - please run the configure tests and
report the results
15>  Unknown compiler version - please run the configure tests and
report the results
14>..\..\libraries\boost\libs\thread\src\win32\tss_pe.cpp(79): warning
C4005: "WIN32_LEAN_AND_MEAN": Makro-Neudefinition
14>  ..\..\libraries\boost\libs\thread\src\win32\tss_pe.cpp(79): note:
Befehlszeilenargumente: siehe vorherige Definition von "WIN32_LEAN_AND_MEAN"
14>  tss_dll.cpp
14>  Unknown compiler version - please run the configure tests and
report the results
15>  greg_month.cpp
14>  thread.cpp
14>  Unknown compiler version - please run the configure tests and
report the results
15>  Unknown compiler version - please run the configure tests and
report the results
14>H:\- Setup\Applications\-
3D\POV-Ray\C++\povray-3.7-stable\libraries\boost\boost/thread/xtime.hpp(23):
error C2059: Syntaxfehler: "Konstante"
14>H:\- Setup\Applications\-
3D\POV-Ray\C++\povray-3.7-stable\libraries\boost\boost/thread/xtime.hpp(31):
error C2143: Syntaxfehler: Es fehlt ";" vor "}"
14>H:\- Setup\Applications\-
3D\POV-Ray\C++\povray-3.7-stable\libraries\boost\boost/thread/xtime.hpp(46):
error C2833: Operator "system_time" ist kein bekannter Operator oder Typ
14>H:\- Setup\Applications\-
3D\POV-Ray\C++\povray-3.7-stable\libraries\boost\boost/thread/xtime.hpp(46):
error C2059: Syntaxfehler: "newline"
14>H:\- Setup\Applications\-
3D\POV-Ray\C++\povray-3.7-stable\libraries\boost\boost/thread/xtime.hpp(47):
error C2334: Unerwartete(s) Token vor "{"; sichtbarer Funktionstext wird
übersprungen
14>H:\- Setup\Applications\-
3D\POV-Ray\C++\povray-3.7-stable\libraries\boost\boost/thread/xtime.hpp(73):
error C3861: "get_system_time": Bezeichner wurde nicht gefunden.
14>H:\- Setup\Applications\-
3D\POV-Ray\C++\povray-3.7-stable\libraries\boost\boost/thread/xtime.hpp(88):
error C2059: Syntaxfehler: "}"
14>H:\- Setup\Applications\-
3D\POV-Ray\C++\povray-3.7-stable\libraries\boost\boost/thread/xtime.hpp(88):
error C2143: Syntaxfehler: Es fehlt ";" vor "}"
14>h:\- setup\applications\-
3d\pov-ray\c++\povray-3.7-stable\libraries\boost\boost\thread\win32\basic_timed_mutex.hpp(22):
error C2143: Syntaxfehler: Es fehlt ";" vor "{"
14>h:\- setup\applications\-
3d\pov-ray\c++\povray-3.7-stable\libraries\boost\boost\thread\win32\basic_timed_mutex.hpp(22):
error C2447: "{": Funktionsheader fehlt - Parameterliste im alten Stil?
14>H:\- Setup\Applications\-
3D\POV-Ray\C++\povray-3.7-stable\libraries\boost\boost/thread/win32/mutex.hpp(19):
error C2039: "basic_timed_mutex": Ist kein Element von "boost::detail"
14>  H:\- Setup\Applications\-
3D\POV-Ray\C++\povray-3.7-stable\libraries\boost\boost/thread/win32/mutex.hpp(17):
note: Siehe Deklaration von "boost::detail"
14>H:\- Setup\Applications\-
3D\POV-Ray\C++\povray-3.7-stable\libraries\boost\boost/thread/win32/mutex.hpp(19):
error C4430: Fehlender Typspezifizierer - int wird angenommen. Hinweis:
"default-int" wird von C++ nicht unterstützt.
14>H:\- Setup\Applications\-
3D\POV-Ray\C++\povray-3.7-stable\libraries\boost\boost/thread/win32/mutex.hpp(19):
error C2146: Syntaxfehler: Fehlendes ";" vor Bezeichner "underlying_mutex"
14>H:\- Setup\Applications\-
3D\POV-Ray\C++\povray-3.7-stable\libraries\boost\boost/thread/win32/mutex.hpp(24):
error C2039: "underlying_mutex": Ist kein Element von "boost::detail"
14>  H:\- Setup\Applications\-
3D\POV-Ray\C++\povray-3.7-stable\libraries\boost\boost/thread/win32/mutex.hpp(17):
note: Siehe Deklaration von "boost::detail"
14>H:\- Setup\Applications\-
3D\POV-Ray\C++\povray-3.7-stable\libraries\boost\boost/thread/win32/mutex.hpp(24):
error C2504: "underlying_mutex": Basisklasse undefiniert
15>..\..\libraries\boost\libs\date_time\src\gregorian\greg_month.cpp(51): error
C2280:
"boost::shared_ptr<boost::gregorian::greg_month::month_map_type>::shared_ptr(const
boost::shared_ptr<boost::gregorian::greg_month::month_map_type> &)" : Es
wurde versucht, auf eine gelöschte Funktion zu verweisen
14>H:\- Setup\Applications\-
3D\POV-Ray\C++\povray-3.7-stable\libraries\boost\boost/thread/win32/mutex.hpp(31):
error C3861: "initialize": Bezeichner wurde nicht gefunden.
15>  H:\- Setup\Applications\-
3D\POV-Ray\C++\povray-3.7-stable\libraries\boost\boost/smart_ptr/shared_ptr.hpp(477):
note: Compiler hat hier
"boost::shared_ptr<boost::gregorian::greg_month::month_map_type>::shared_ptr"
generiert
14>H:\- Setup\Applications\-
3D\POV-Ray\C++\povray-3.7-stable\libraries\boost\boost/thread/win32/mutex.hpp(35):
error C3861: "destroy": Bezeichner wurde nicht gefunden.
14>H:\- Setup\Applications\-
3D\POV-Ray\C++\povray-3.7-stable\libraries\boost\boost/thread/win32/mutex.hpp(46):
error C2516: "boost::detail::basic_timed_mutex": Keine zulässige Basisklasse
14>  H:\- Setup\Applications\-
3D\POV-Ray\C++\povray-3.7-stable\libraries\boost\boost/thread/win32/mutex.hpp(19):
note: Siehe Deklaration von "boost::detail::basic_timed_mutex"
14>H:\- Setup\Applications\-
3D\POV-Ray\C++\povray-3.7-stable\libraries\boost\boost/thread/win32/mutex.hpp(53):
error C3861: "initialize": Bezeichner wurde nicht gefunden.
14>H:\- Setup\Applications\-
3D\POV-Ray\C++\povray-3.7-stable\libraries\boost\boost/thread/win32/mutex.hpp(58):
error C3861: "destroy": Bezeichner wurde nicht gefunden.
14>H:\- Setup\Applications\-
3D\POV-Ray\C++\povray-3.7-stable\libraries\boost\boost/thread/detail/thread.hpp(385):
error C2440: "<function-style-cast>": "const boost::xtime" kann nicht in
"boost::system_time" konvertiert werden
14>  H:\- Setup\Applications\-
3D\POV-Ray\C++\povray-3.7-stable\libraries\boost\boost/thread/detail/thread.hpp(385):
note: Quelltyp konnte von keinem Konstruktor angenommen werden, oder die
Überladungsauflösung des Konstruktors ist mehrdeutig
15>  date_generators.cpp
14>  Code wird generiert...
16>------ Erstellen gestartet: Projekt: IlmImf, Konfiguration: Debug
Win32 ------
15>  Unknown compiler version - please run the configure tests and
report the results
15>  Code wird generiert...
16>  ImfZipCompressor.cpp
16>H:\Program Files (x86)\Microsoft Visual Studio
14.0\VC\include\yvals.h(26): warning C4005: "_HAS_CPP0X":
Makro-Neudefinition
16>  H:\Program Files (x86)\Microsoft Visual Studio
14.0\VC\include\yvals.h(26): note: Befehlszeilenargumente: siehe
vorherige Definition von "_HAS_CPP0X"
17>------ Erstellen gestartet: Projekt: Iex, Konfiguration: Debug Win32
------
17>  IexThrowErrnoExc.cpp
17>H:\Program Files (x86)\Microsoft Visual Studio
14.0\VC\include\yvals.h(26): warning C4005: "_HAS_CPP0X":
Makro-Neudefinition
17>  H:\Program Files (x86)\Microsoft Visual Studio
14.0\VC\include\yvals.h(26): note: Befehlszeilenargumente: siehe
vorherige Definition von "_HAS_CPP0X"
16>  ImfWav.cpp
16>  ImfVersion.cpp
16>  ImfVecAttribute.cpp
16>H:\Program Files (x86)\Microsoft Visual Studio
14.0\VC\include\yvals.h(26): warning C4005: "_HAS_CPP0X":
Makro-Neudefinition
16>  H:\Program Files (x86)\Microsoft Visual Studio
14.0\VC\include\yvals.h(26): note: Befehlszeilenargumente: siehe
vorherige Definition von "_HAS_CPP0X"
17>..\..\libraries\ilmbase\Iex\IexThrowErrnoExc.cpp(54): warning C4996:
'strerror': This function or variable may be unsafe. Consider using
strerror_s instead. To disable deprecation, use _CRT_SECURE_NO_WARNINGS.
See online help for details.
17>  C:\Program Files (x86)\Windows
Kits\10\Include\10.0.10240.0\ucrt\string.h(178): note: Siehe Deklaration
von "strerror"
16>  ImfTimeCodeAttribute.cpp
17>  IexBaseExc.cpp
17>H:\Program Files (x86)\Microsoft Visual Studio
14.0\VC\include\yvals.h(26): warning C4005: "_HAS_CPP0X":
Makro-Neudefinition
17>  H:\Program Files (x86)\Microsoft Visual Studio
14.0\VC\include\yvals.h(26): note: Befehlszeilenargumente: siehe
vorherige Definition von "_HAS_CPP0X"
16>H:\Program Files (x86)\Microsoft Visual Studio
14.0\VC\include\yvals.h(26): warning C4005: "_HAS_CPP0X":
Makro-Neudefinition
16>  H:\Program Files (x86)\Microsoft Visual Studio
14.0\VC\include\yvals.h(26): note: Befehlszeilenargumente: siehe
vorherige Definition von "_HAS_CPP0X"
16>  ImfTimeCode.cpp
17>  Code wird generiert...
16>H:\Program Files (x86)\Microsoft Visual Studio
14.0\VC\include\yvals.h(26): warning C4005: "_HAS_CPP0X":
Makro-Neudefinition
16>  H:\Program Files (x86)\Microsoft Visual Studio
14.0\VC\include\yvals.h(26): note: Befehlszeilenargumente: siehe
vorherige Definition von "_HAS_CPP0X"
17>  openexr_Iex.vcxproj -> H:\- Setup\Applications\-
3D\POV-Ray\C++\povray-3.7-stable\windows\vs10\bin32\lib\Iex32d.lib
16>..\..\libraries\openexr\IlmImf\ImfTimeCode.cpp(236): warning C4800:
"unsigned int": Variable wird auf booleschen Wert ("True" oder "False")
gesetzt (Auswirkungen auf Leistungsverhalten möglich)
16>..\..\libraries\openexr\IlmImf\ImfTimeCode.cpp(250): warning C4800:
"unsigned int": Variable wird auf booleschen Wert ("True" oder "False")
gesetzt (Auswirkungen auf Leistungsverhalten möglich)
16>..\..\libraries\openexr\IlmImf\ImfTimeCode.cpp(264): warning C4800:
"unsigned int": Variable wird auf booleschen Wert ("True" oder "False")
gesetzt (Auswirkungen auf Leistungsverhalten möglich)
16>..\..\libraries\openexr\IlmImf\ImfTimeCode.cpp(278): warning C4800:
"unsigned int": Variable wird auf booleschen Wert ("True" oder "False")
gesetzt (Auswirkungen auf Leistungsverhalten möglich)
16>..\..\libraries\openexr\IlmImf\ImfTimeCode.cpp(292): warning C4800:
"unsigned int": Variable wird auf booleschen Wert ("True" oder "False")
gesetzt (Auswirkungen auf Leistungsverhalten möglich)
16>..\..\libraries\openexr\IlmImf\ImfTimeCode.cpp(306): warning C4800:
"unsigned int": Variable wird auf booleschen Wert ("True" oder "False")
gesetzt (Auswirkungen auf Leistungsverhalten möglich)
18>------ Erstellen gestartet: Projekt: IlmThread, Konfiguration: Debug
Win32 ------
18>  IlmThreadWin32.cpp
18>H:\Program Files (x86)\Microsoft Visual Studio
14.0\VC\include\yvals.h(26): warning C4005: "_HAS_CPP0X":
Makro-Neudefinition
18>  H:\Program Files (x86)\Microsoft Visual Studio
14.0\VC\include\yvals.h(26): note: Befehlszeilenargumente: siehe
vorherige Definition von "_HAS_CPP0X"
18>..\..\libraries\ilmbase\IlmThread\IlmThreadWin32.cpp(79): warning
C4800: "BOOL": Variable wird auf booleschen Wert ("True" oder "False")
gesetzt (Auswirkungen auf Leistungsverhalten möglich)
16>  ImfTileOffsets.cpp
16>H:\Program Files (x86)\Microsoft Visual Studio
14.0\VC\include\yvals.h(26): warning C4005: "_HAS_CPP0X":
Makro-Neudefinition
16>  H:\Program Files (x86)\Microsoft Visual Studio
14.0\VC\include\yvals.h(26): note: Befehlszeilenargumente: siehe
vorherige Definition von "_HAS_CPP0X"
18>  IlmThreadSemaphoreWin32.cpp
18>H:\Program Files (x86)\Microsoft Visual Studio
14.0\VC\include\yvals.h(26): warning C4005: "_HAS_CPP0X":
Makro-Neudefinition
18>  H:\Program Files (x86)\Microsoft Visual Studio
14.0\VC\include\yvals.h(26): note: Befehlszeilenargumente: siehe
vorherige Definition von "_HAS_CPP0X"
16>..\..\libraries\openexr\IlmImf\ImfTileOffsets.cpp(80): warning C4018:
"<": Konflikt zwischen "signed" und "unsigned"
16>..\..\libraries\openexr\IlmImf\ImfTileOffsets.cpp(82): warning C4018:
"<": Konflikt zwischen "signed" und "unsigned"
16>..\..\libraries\openexr\IlmImf\ImfTileOffsets.cpp(262): warning
C4018: ">": Konflikt zwischen "signed" und "unsigned"
16>..\..\libraries\openexr\IlmImf\ImfTileOffsets.cpp(263): warning
C4018: ">": Konflikt zwischen "signed" und "unsigned"
16>..\..\libraries\openexr\IlmImf\ImfTileOffsets.cpp(274): warning
C4018: ">": Konflikt zwischen "signed" und "unsigned"
16>..\..\libraries\openexr\IlmImf\ImfTileOffsets.cpp(275): warning
C4018: ">": Konflikt zwischen "signed" und "unsigned"
16>..\..\libraries\openexr\IlmImf\ImfTileOffsets.cpp(276): warning
C4018: ">": Konflikt zwischen "signed" und "unsigned"
16>..\..\libraries\openexr\IlmImf\ImfTileOffsets.cpp(287): warning
C4018: ">": Konflikt zwischen "signed" und "unsigned"
16>..\..\libraries\openexr\IlmImf\ImfTileOffsets.cpp(288): warning
C4018: ">": Konflikt zwischen "signed" und "unsigned"
16>..\..\libraries\openexr\IlmImf\ImfTileOffsets.cpp(289): warning
C4018: ">": Konflikt zwischen "signed" und "unsigned"
18>..\..\libraries\ilmbase\IlmThread\IlmThreadSemaphoreWin32.cpp(98):
warning C4800: "BOOL": Variable wird auf booleschen Wert ("True" oder
"False") gesetzt (Auswirkungen auf Leistungsverhalten möglich)
16>  ImfTiledRgbaFile.cpp
16>H:\- Setup\Applications\-
3D\POV-Ray\C++\povray-3.7-stable\libraries\openexr\IlmImf\ImfName.h(103): warning
C4996: 'strncpy': This function or variable may be unsafe. Consider
using strncpy_s instead. To disable deprecation, use
_CRT_SECURE_NO_WARNINGS. See online help for details.
16>  C:\Program Files (x86)\Windows
Kits\10\Include\10.0.10240.0\ucrt\string.h(346): note: Siehe Deklaration
von "strncpy"
16>H:\Program Files (x86)\Microsoft Visual Studio
14.0\VC\include\yvals.h(26): warning C4005: "_HAS_CPP0X":
Makro-Neudefinition
16>  H:\Program Files (x86)\Microsoft Visual Studio
14.0\VC\include\yvals.h(26): note: Befehlszeilenargumente: siehe
vorherige Definition von "_HAS_CPP0X"
18>  IlmThreadSemaphorePosixCompat.cpp
18>  IlmThreadSemaphorePosix.cpp
18>  IlmThreadSemaphore.cpp
18>  IlmThreadPosix.cpp
18>  IlmThreadPool.cpp
18>H:\Program Files (x86)\Microsoft Visual Studio
14.0\VC\include\yvals.h(26): warning C4005: "_HAS_CPP0X":
Makro-Neudefinition
18>  H:\Program Files (x86)\Microsoft Visual Studio
14.0\VC\include\yvals.h(26): note: Befehlszeilenargumente: siehe
vorherige Definition von "_HAS_CPP0X"
18>..\..\libraries\ilmbase\IlmThread\IlmThreadPool.cpp(250): warning
C4018: "<": Konflikt zwischen "signed" und "unsigned"
18>..\..\libraries\ilmbase\IlmThread\IlmThreadPool.cpp(367): warning
C4018: ">": Konflikt zwischen "signed" und "unsigned"
18>..\..\libraries\ilmbase\IlmThread\IlmThreadPool.cpp(373): warning
C4018: "<": Konflikt zwischen "signed" und "unsigned"
18>..\..\libraries\ilmbase\IlmThread\IlmThreadPool.cpp(379): warning
C4018: "<": Konflikt zwischen "signed" und "unsigned"
18>..\..\libraries\ilmbase\IlmThread\IlmThreadPool.cpp(392): warning
C4018: "<": Konflikt zwischen "signed" und "unsigned"
18>  IlmThreadMutexWin32.cpp
16>  ImfTiledOutputFile.cpp
16>H:\- Setup\Applications\-
3D\POV-Ray\C++\povray-3.7-stable\libraries\openexr\IlmImf\ImfName.h(103): warning
C4996: 'strncpy': This function or variable may be unsafe. Consider
using strncpy_s instead. To disable deprecation, use
_CRT_SECURE_NO_WARNINGS. See online help for details.
16>  C:\Program Files (x86)\Windows
Kits\10\Include\10.0.10240.0\ucrt\string.h(346): note: Siehe Deklaration
von "strncpy"
16>H:\Program Files (x86)\Microsoft Visual Studio
14.0\VC\include\yvals.h(26): warning C4005: "_HAS_CPP0X":
Makro-Neudefinition
16>  H:\Program Files (x86)\Microsoft Visual Studio
14.0\VC\include\yvals.h(26): note: Befehlszeilenargumente: siehe
vorherige Definition von "_HAS_CPP0X"
18>H:\Program Files (x86)\Microsoft Visual Studio
14.0\VC\include\yvals.h(26): warning C4005: "_HAS_CPP0X":
Makro-Neudefinition
18>  H:\Program Files (x86)\Microsoft Visual Studio
14.0\VC\include\yvals.h(26): note: Befehlszeilenargumente: siehe
vorherige Definition von "_HAS_CPP0X"
18>  IlmThreadMutexPosix.cpp
18>  IlmThreadMutex.cpp
16>..\..\libraries\openexr\IlmImf\ImfTiledOutputFile.cpp(76): error
C2039: "min": Ist kein Element von "std"
16>  H:\Program Files (x86)\Microsoft Visual Studio
14.0\VC\include\vector(17): note: Siehe Deklaration von "std"
18>  IlmThread.cpp
16>..\..\libraries\openexr\IlmImf\ImfTiledOutputFile.cpp(76): error
C2873: "min": Das Symbol kann nicht in einer using-Deklaration verwendet
werden
16>..\..\libraries\openexr\IlmImf\ImfTiledOutputFile.cpp(77): error
C2039: "max": Ist kein Element von "std"
16>  H:\Program Files (x86)\Microsoft Visual Studio
14.0\VC\include\vector(17): note: Siehe Deklaration von "std"
16>..\..\libraries\openexr\IlmImf\ImfTiledOutputFile.cpp(77): error
C2873: "max": Das Symbol kann nicht in einer using-Deklaration verwendet
werden
16>..\..\libraries\openexr\IlmImf\ImfTiledOutputFile.cpp(295): error
C3861: "max": Bezeichner wurde nicht gefunden.
16>..\..\libraries\openexr\IlmImf\ImfTiledOutputFile.cpp(1137): error
C3861: "min": Bezeichner wurde nicht gefunden.
16>..\..\libraries\openexr\IlmImf\ImfTiledOutputFile.cpp(1267): warning
C4018: "<": Konflikt zwischen "signed" und "unsigned"
16>..\..\libraries\openexr\IlmImf\ImfTiledOutputFile.cpp(1383): warning
C4018: "<": Konflikt zwischen "signed" und "unsigned"
16>..\..\libraries\openexr\IlmImf\ImfTiledOutputFile.cpp(1390): warning
C4018: "<": Konflikt zwischen "signed" und "unsigned"
16>..\..\libraries\openexr\IlmImf\ImfTiledOutputFile.cpp(1391): warning
C4018: "<": Konflikt zwischen "signed" und "unsigned"
18>  Code wird generiert...
16>  ImfTiledMisc.cpp
16>H:\Program Files (x86)\Microsoft Visual Studio
14.0\VC\include\yvals.h(26): warning C4005: "_HAS_CPP0X":
Makro-Neudefinition
16>  H:\Program Files (x86)\Microsoft Visual Studio
14.0\VC\include\yvals.h(26): note: Befehlszeilenargumente: siehe
vorherige Definition von "_HAS_CPP0X"
18>  openexr_IlmThread.vcxproj -> H:\- Setup\Applications\-
3D\POV-Ray\C++\povray-3.7-stable\windows\vs10\bin32\lib\IlmThread32d.lib
16>H:\- Setup\Applications\-
3D\POV-Ray\C++\povray-3.7-stable\libraries\openexr\IlmImf\ImfName.h(103): warning
C4996: 'strncpy': This function or variable may be unsafe. Consider
using strncpy_s instead. To disable deprecation, use
_CRT_SECURE_NO_WARNINGS. See online help for details.
16>  C:\Program Files (x86)\Windows
Kits\10\Include\10.0.10240.0\ucrt\string.h(346): note: Siehe Deklaration
von "strncpy"
16>..\..\libraries\openexr\IlmImf\ImfTiledMisc.cpp(67): error C2039:
"max": Ist kein Element von "std"
16>  H:\Program Files (x86)\Microsoft Visual Studio
14.0\VC\include\set(12): note: Siehe Deklaration von "std"
16>..\..\libraries\openexr\IlmImf\ImfTiledMisc.cpp(67): error C2064:
Ausdruck ergibt keine Funktion, die 2 Argumente übernimmt
16>..\..\libraries\openexr\IlmImf\ImfTiledMisc.cpp(102): error C2039:
"min": Ist kein Element von "std"
16>  H:\Program Files (x86)\Microsoft Visual Studio
14.0\VC\include\set(12): note: Siehe Deklaration von "std"
16>..\..\libraries\openexr\IlmImf\ImfTiledMisc.cpp(102): error C3861:
"min": Bezeichner wurde nicht gefunden.
16>..\..\libraries\openexr\IlmImf\ImfTiledMisc.cpp(103): error C2039:
"min": Ist kein Element von "std"
16>  H:\Program Files (x86)\Microsoft Visual Studio
14.0\VC\include\set(12): note: Siehe Deklaration von "std"
16>..\..\libraries\openexr\IlmImf\ImfTiledMisc.cpp(103): error C3861:
"min": Bezeichner wurde nicht gefunden.
16>..\..\libraries\openexr\IlmImf\ImfTiledMisc.cpp(197): error C2039:
"max": Ist kein Element von "std"
16>  H:\Program Files (x86)\Microsoft Visual Studio
14.0\VC\include\set(12): note: Siehe Deklaration von "std"
16>..\..\libraries\openexr\IlmImf\ImfTiledMisc.cpp(197): error C3861:
"max": Bezeichner wurde nicht gefunden.
16>..\..\libraries\openexr\IlmImf\ImfTiledMisc.cpp(237): error C2039:
"max": Ist kein Element von "std"
16>  H:\Program Files (x86)\Microsoft Visual Studio
14.0\VC\include\set(12): note: Siehe Deklaration von "std"
16>..\..\libraries\openexr\IlmImf\ImfTiledMisc.cpp(237): error C3861:
"max": Bezeichner wurde nicht gefunden.
16>  ImfTiledInputFile.cpp
16>H:\- Setup\Applications\-
3D\POV-Ray\C++\povray-3.7-stable\libraries\openexr\IlmImf\ImfName.h(103): warning
C4996: 'strncpy': This function or variable may be unsafe. Consider
using strncpy_s instead. To disable deprecation, use
_CRT_SECURE_NO_WARNINGS. See online help for details.
16>  C:\Program Files (x86)\Windows
Kits\10\Include\10.0.10240.0\ucrt\string.h(346): note: Siehe Deklaration
von "strncpy"
16>H:\Program Files (x86)\Microsoft Visual Studio
14.0\VC\include\yvals.h(26): warning C4005: "_HAS_CPP0X":
Makro-Neudefinition
16>  H:\Program Files (x86)\Microsoft Visual Studio
14.0\VC\include\yvals.h(26): note: Befehlszeilenargumente: siehe
vorherige Definition von "_HAS_CPP0X"
16>..\..\libraries\openexr\IlmImf\ImfTiledInputFile.cpp(1029): warning
C4018: "<": Konflikt zwischen "signed" und "unsigned"
16>  ImfTileDescriptionAttribute.cpp
16>H:\Program Files (x86)\Microsoft Visual Studio
14.0\VC\include\yvals.h(26): warning C4005: "_HAS_CPP0X":
Makro-Neudefinition
16>  H:\Program Files (x86)\Microsoft Visual Studio
14.0\VC\include\yvals.h(26): note: Befehlszeilenargumente: siehe
vorherige Definition von "_HAS_CPP0X"
16>  ImfThreading.cpp
16>  ImfTestFile.cpp
16>H:\Program Files (x86)\Microsoft Visual Studio
14.0\VC\include\yvals.h(26): warning C4005: "_HAS_CPP0X":
Makro-Neudefinition
16>  H:\Program Files (x86)\Microsoft Visual Studio
14.0\VC\include\yvals.h(26): note: Befehlszeilenargumente: siehe
vorherige Definition von "_HAS_CPP0X"
16>  ImfStringAttribute.cpp
16>H:\Program Files (x86)\Microsoft Visual Studio
14.0\VC\include\yvals.h(26): warning C4005: "_HAS_CPP0X":
Makro-Neudefinition
16>  H:\Program Files (x86)\Microsoft Visual Studio
14.0\VC\include\yvals.h(26): note: Befehlszeilenargumente: siehe
vorherige Definition von "_HAS_CPP0X"
19>------ Erstellen gestartet: Projekt: cmedit, Konfiguration: Debug
Win32 ------
16>  ImfStdIO.cpp
19>  StdStringList.cpp
16>H:\Program Files (x86)\Microsoft Visual Studio
14.0\VC\include\yvals.h(26): warning C4005: "_HAS_CPP0X":
Makro-Neudefinition
16>  H:\Program Files (x86)\Microsoft Visual Studio
14.0\VC\include\yvals.h(26): note: Befehlszeilenargumente: siehe
vorherige Definition von "_HAS_CPP0X"
16>  ImfStandardAttributes.cpp
16>H:\- Setup\Applications\-
3D\POV-Ray\C++\povray-3.7-stable\libraries\openexr\IlmImf\ImfName.h(103): warning
C4996: 'strncpy': This function or variable may be unsafe. Consider
using strncpy_s instead. To disable deprecation, use
_CRT_SECURE_NO_WARNINGS. See online help for details.
16>  C:\Program Files (x86)\Windows
Kits\10\Include\10.0.10240.0\ucrt\string.h(346): note: Siehe Deklaration
von "strncpy"
16>H:\Program Files (x86)\Microsoft Visual Studio
14.0\VC\include\yvals.h(26): warning C4005: "_HAS_CPP0X":
Makro-Neudefinition
16>  H:\Program Files (x86)\Microsoft Visual Studio
14.0\VC\include\yvals.h(26): note: Befehlszeilenargumente: siehe
vorherige Definition von "_HAS_CPP0X"
19>H:\Program Files (x86)\Microsoft Visual Studio
14.0\VC\include\yvals.h(26): warning C4005: "_HAS_CPP0X":
Makro-Neudefinition
19>  H:\Program Files (x86)\Microsoft Visual Studio
14.0\VC\include\yvals.h(26): note: Befehlszeilenargumente: siehe
vorherige Definition von "_HAS_CPP0X"
16>  ImfScanLineInputFile.cpp
16>H:\- Setup\Applications\-
3D\POV-Ray\C++\povray-3.7-stable\libraries\openexr\IlmImf\ImfName.h(103): warning
C4996: 'strncpy': This function or variable may be unsafe. Consider
using strncpy_s instead. To disable deprecation, use
_CRT_SECURE_NO_WARNINGS. See online help for details.
16>  C:\Program Files (x86)\Windows
Kits\10\Include\10.0.10240.0\ucrt\string.h(346): note: Siehe Deklaration
von "strncpy"
16>H:\Program Files (x86)\Microsoft Visual Studio
14.0\VC\include\yvals.h(26): warning C4005: "_HAS_CPP0X":
Makro-Neudefinition
16>  H:\Program Files (x86)\Microsoft Visual Studio
14.0\VC\include\yvals.h(26): note: Befehlszeilenargumente: siehe
vorherige Definition von "_HAS_CPP0X"
19>  settings.cpp
16>..\..\libraries\openexr\IlmImf\ImfScanLineInputFile.cpp(69): error
C2039: "min": Ist kein Element von "std"
16>  H:\Program Files (x86)\Microsoft Visual Studio
14.0\VC\include\fstream(13): note: Siehe Deklaration von "std"
16>..\..\libraries\openexr\IlmImf\ImfScanLineInputFile.cpp(69): error
C2873: "min": Das Symbol kann nicht in einer using-Deklaration verwendet
werden
16>..\..\libraries\openexr\IlmImf\ImfScanLineInputFile.cpp(70): error
C2039: "max": Ist kein Element von "std"
16>  H:\Program Files (x86)\Microsoft Visual Studio
14.0\VC\include\fstream(13): note: Siehe Deklaration von "std"
16>..\..\libraries\openexr\IlmImf\ImfScanLineInputFile.cpp(70): error
C2873: "max": Das Symbol kann nicht in einer using-Deklaration verwendet
werden
16>..\..\libraries\openexr\IlmImf\ImfScanLineInputFile.cpp(221): error
C3861: "max": Bezeichner wurde nicht gefunden.
16>..\..\libraries\openexr\IlmImf\ImfScanLineInputFile.cpp(455): error
C3861: "min": Bezeichner wurde nicht gefunden.
16>..\..\libraries\openexr\IlmImf\ImfScanLineInputFile.cpp(638): error
C3861: "max": Bezeichner wurde nicht gefunden.
16>..\..\libraries\openexr\IlmImf\ImfScanLineInputFile.cpp(639): error
C3861: "min": Bezeichner wurde nicht gefunden.
16>..\..\libraries\openexr\IlmImf\ImfScanLineInputFile.cpp(868): error
C3861: "min": Bezeichner wurde nicht gefunden.
16>..\..\libraries\openexr\IlmImf\ImfScanLineInputFile.cpp(869): error
C3861: "max": Bezeichner wurde nicht gefunden.
16>..\..\libraries\openexr\IlmImf\ImfScanLineInputFile.cpp(948): warning
C4018: "<": Konflikt zwischen "signed" und "unsigned"
19>H:\Program Files (x86)\Microsoft Visual Studio
14.0\VC\include\yvals.h(26): warning C4005: "_HAS_CPP0X":
Makro-Neudefinition
19>  H:\Program Files (x86)\Microsoft Visual Studio
14.0\VC\include\yvals.h(26): note: Befehlszeilenargumente: siehe
vorherige Definition von "_HAS_CPP0X"
16>  ImfRleCompressor.cpp
16>H:\Program Files (x86)\Microsoft Visual Studio
14.0\VC\include\yvals.h(26): warning C4005: "_HAS_CPP0X":
Makro-Neudefinition
16>  H:\Program Files (x86)\Microsoft Visual Studio
14.0\VC\include\yvals.h(26): note: Befehlszeilenargumente: siehe
vorherige Definition von "_HAS_CPP0X"
16>  ImfRgbaYca.cpp
16>H:\Program Files (x86)\Microsoft Visual Studio
14.0\VC\include\yvals.h(26): warning C4005: "_HAS_CPP0X":
Makro-Neudefinition
16>  H:\Program Files (x86)\Microsoft Visual Studio
14.0\VC\include\yvals.h(26): note: Befehlszeilenargumente: siehe
vorherige Definition von "_HAS_CPP0X"
19>  menusupport.cpp
16>..\..\libraries\openexr\IlmImf\ImfRgbaYca.cpp(161): warning C4244:
"Argument": Konvertierung von "double" in "float", möglicher Datenverlust
16>..\..\libraries\openexr\IlmImf\ImfRgbaYca.cpp(177): warning C4244:
"Argument": Konvertierung von "double" in "float", möglicher Datenverlust
16>..\..\libraries\openexr\IlmImf\ImfRgbaYca.cpp(209): warning C4244:
"Argument": Konvertierung von "double" in "float", möglicher Datenverlust
16>..\..\libraries\openexr\IlmImf\ImfRgbaYca.cpp(225): warning C4244:
"Argument": Konvertierung von "double" in "float", möglicher Datenverlust
16>..\..\libraries\openexr\IlmImf\ImfRgbaYca.cpp(284): warning C4244:
"Argument": Konvertierung von "double" in "float", möglicher Datenverlust
16>..\..\libraries\openexr\IlmImf\ImfRgbaYca.cpp(299): warning C4244:
"Argument": Konvertierung von "double" in "float", möglicher Datenverlust
16>..\..\libraries\openexr\IlmImf\ImfRgbaYca.cpp(333): warning C4244:
"Argument": Konvertierung von "double" in "float", möglicher Datenverlust
16>..\..\libraries\openexr\IlmImf\ImfRgbaYca.cpp(348): warning C4244:
"Argument": Konvertierung von "double" in "float", möglicher Datenverlust
16>  Code wird generiert...
19>H:\Program Files (x86)\Microsoft Visual Studio
14.0\VC\include\yvals.h(26): warning C4005: "_HAS_CPP0X":
Makro-Neudefinition
19>  H:\Program Files (x86)\Microsoft Visual Studio
14.0\VC\include\yvals.h(26): note: Befehlszeilenargumente: siehe
vorherige Definition von "_HAS_CPP0X"
19>  eventhandlers.cpp
16>  Kompilieren...
16>  ImfRgbaFile.cpp
16>H:\- Setup\Applications\-
3D\POV-Ray\C++\povray-3.7-stable\libraries\openexr\IlmImf\ImfName.h(103): warning
C4996: 'strncpy': This function or variable may be unsafe. Consider
using strncpy_s instead. To disable deprecation, use
_CRT_SECURE_NO_WARNINGS. See online help for details.
16>  C:\Program Files (x86)\Windows
Kits\10\Include\10.0.10240.0\ucrt\string.h(346): note: Siehe Deklaration
von "strncpy"
16>H:\Program Files (x86)\Microsoft Visual Studio
14.0\VC\include\yvals.h(26): warning C4005: "_HAS_CPP0X":
Makro-Neudefinition
16>  H:\Program Files (x86)\Microsoft Visual Studio
14.0\VC\include\yvals.h(26): note: Befehlszeilenargumente: siehe
vorherige Definition von "_HAS_CPP0X"
19>H:\Program Files (x86)\Microsoft Visual Studio
14.0\VC\include\yvals.h(26): warning C4005: "_HAS_CPP0X":
Makro-Neudefinition
19>  H:\Program Files (x86)\Microsoft Visual Studio
14.0\VC\include\yvals.h(26): note: Befehlszeilenargumente: siehe
vorherige Definition von "_HAS_CPP0X"
19>  editorinterface.cpp
16>  ImfRationalAttribute.cpp
16>H:\Program Files (x86)\Microsoft Visual Studio
14.0\VC\include\yvals.h(26): warning C4005: "_HAS_CPP0X":
Makro-Neudefinition
16>  H:\Program Files (x86)\Microsoft Visual Studio
14.0\VC\include\yvals.h(26): note: Befehlszeilenargumente: siehe
vorherige Definition von "_HAS_CPP0X"
19>H:\Program Files (x86)\Microsoft Visual Studio
14.0\VC\include\yvals.h(26): warning C4005: "_HAS_CPP0X":
Makro-Neudefinition
16>  ImfRational.cpp
19>  H:\Program Files (x86)\Microsoft Visual Studio
14.0\VC\include\yvals.h(26): note: Befehlszeilenargumente: siehe
vorherige Definition von "_HAS_CPP0X"
16>H:\Program Files (x86)\Microsoft Visual Studio
14.0\VC\include\yvals.h(26): warning C4005: "_HAS_CPP0X":
Makro-Neudefinition
16>  H:\Program Files (x86)\Microsoft Visual Studio
14.0\VC\include\yvals.h(26): note: Befehlszeilenargumente: siehe
vorherige Definition von "_HAS_CPP0X"
16>  ImfPxr24Compressor.cpp
16>H:\Program Files (x86)\Microsoft Visual Studio
14.0\VC\include\yvals.h(26): warning C4005: "_HAS_CPP0X":
Makro-Neudefinition
16>  H:\Program Files (x86)\Microsoft Visual Studio
14.0\VC\include\yvals.h(26): note: Befehlszeilenargumente: siehe
vorherige Definition von "_HAS_CPP0X"
16>H:\- Setup\Applications\-
3D\POV-Ray\C++\povray-3.7-stable\libraries\openexr\IlmImf\ImfName.h(103): warning
C4996: 'strncpy': This function or variable may be unsafe. Consider
using strncpy_s instead. To disable deprecation, use
_CRT_SECURE_NO_WARNINGS. See online help for details.
16>  C:\Program Files (x86)\Windows
Kits\10\Include\10.0.10240.0\ucrt\string.h(346): note: Siehe Deklaration
von "strncpy"
16>..\..\libraries\openexr\IlmImf\ImfPxr24Compressor.cpp(460): warning
C4018: ">": Konflikt zwischen "signed" und "unsigned"
19>..\cmedit\editorinterface.cpp(846): warning C4996: 'GetVersionExA':
wurde als veraltet deklariert
16>..\..\libraries\openexr\IlmImf\ImfPxr24Compressor.cpp(486): warning
C4018: ">": Konflikt zwischen "signed" und "unsigned"
19>  C:\Program Files (x86)\Windows
Kits\8.1\Include\um\sysinfoapi.h(433): note: Siehe Deklaration von
"GetVersionExA"
16>..\..\libraries\openexr\IlmImf\ImfPxr24Compressor.cpp(510): warning
C4018: ">": Konflikt zwischen "signed" und "unsigned"
16>..\..\libraries\openexr\IlmImf\ImfPxr24Compressor.cpp(535): warning
C4018: "<": Konflikt zwischen "signed" und "unsigned"
16>  ImfPreviewImageAttribute.cpp
16>H:\Program Files (x86)\Microsoft Visual Studio
14.0\VC\include\yvals.h(26): warning C4005: "_HAS_CPP0X":
Makro-Neudefinition
16>  H:\Program Files (x86)\Microsoft Visual Studio
14.0\VC\include\yvals.h(26): note: Befehlszeilenargumente: siehe
vorherige Definition von "_HAS_CPP0X"
19>  dialogs.cpp
16>  ImfPreviewImage.cpp
16>H:\Program Files (x86)\Microsoft Visual Studio
14.0\VC\include\yvals.h(26): warning C4005: "_HAS_CPP0X":
Makro-Neudefinition
16>  H:\Program Files (x86)\Microsoft Visual Studio
14.0\VC\include\yvals.h(26): note: Befehlszeilenargumente: siehe
vorherige Definition von "_HAS_CPP0X"
19>H:\Program Files (x86)\Microsoft Visual Studio
14.0\VC\include\yvals.h(26): warning C4005: "_HAS_CPP0X":
Makro-Neudefinition
19>  H:\Program Files (x86)\Microsoft Visual Studio
14.0\VC\include\yvals.h(26): note: Befehlszeilenargumente: siehe
vorherige Definition von "_HAS_CPP0X"
16>  ImfPizCompressor.cpp
16>H:\Program Files (x86)\Microsoft Visual Studio
14.0\VC\include\yvals.h(26): warning C4005: "_HAS_CPP0X":
Makro-Neudefinition
16>  H:\Program Files (x86)\Microsoft Visual Studio
14.0\VC\include\yvals.h(26): note: Befehlszeilenargumente: siehe
vorherige Definition von "_HAS_CPP0X"
16>H:\- Setup\Applications\-
3D\POV-Ray\C++\povray-3.7-stable\libraries\openexr\IlmImf\ImfName.h(103): warning
C4996: 'strncpy': This function or variable may be unsafe. Consider
using strncpy_s instead. To disable deprecation, use
_CRT_SECURE_NO_WARNINGS. See online help for details.
16>  C:\Program Files (x86)\Windows
Kits\10\Include\10.0.10240.0\ucrt\string.h(346): note: Siehe Deklaration
von "strncpy"
19>  cmedit.cpp
16>  ImfOutputFile.cpp
16>H:\- Setup\Applications\-
3D\POV-Ray\C++\povray-3.7-stable\libraries\openexr\IlmImf\ImfName.h(103): warning
C4996: 'strncpy': This function or variable may be unsafe. Consider
using strncpy_s instead. To disable deprecation, use
_CRT_SECURE_NO_WARNINGS. See online help for details.
16>  C:\Program Files (x86)\Windows
Kits\10\Include\10.0.10240.0\ucrt\string.h(346): note: Siehe Deklaration
von "strncpy"
16>H:\Program Files (x86)\Microsoft Visual Studio
14.0\VC\include\yvals.h(26): warning C4005: "_HAS_CPP0X":
Makro-Neudefinition
16>  H:\Program Files (x86)\Microsoft Visual Studio
14.0\VC\include\yvals.h(26): note: Befehlszeilenargumente: siehe
vorherige Definition von "_HAS_CPP0X"
19>H:\Program Files (x86)\Microsoft Visual Studio
14.0\VC\include\yvals.h(26): warning C4005: "_HAS_CPP0X":
Makro-Neudefinition
19>  H:\Program Files (x86)\Microsoft Visual Studio
14.0\VC\include\yvals.h(26): note: Befehlszeilenargumente: siehe
vorherige Definition von "_HAS_CPP0X"
16>..\..\libraries\openexr\IlmImf\ImfOutputFile.cpp(71): error C2039:
"min": Ist kein Element von "std"
16>  H:\Program Files (x86)\Microsoft Visual Studio
14.0\VC\include\vector(17): note: Siehe Deklaration von "std"
16>..\..\libraries\openexr\IlmImf\ImfOutputFile.cpp(71): error C2873:
"min": Das Symbol kann nicht in einer using-Deklaration verwendet werden
16>..\..\libraries\openexr\IlmImf\ImfOutputFile.cpp(72): error C2039:
"max": Ist kein Element von "std"
16>  H:\Program Files (x86)\Microsoft Visual Studio
14.0\VC\include\vector(17): note: Siehe Deklaration von "std"
16>..\..\libraries\openexr\IlmImf\ImfOutputFile.cpp(72): error C2873:
"max": Das Symbol kann nicht in einer using-Deklaration verwendet werden
16>..\..\libraries\openexr\IlmImf\ImfOutputFile.cpp(221): error C3861:
"max": Bezeichner wurde nicht gefunden.
16>..\..\libraries\openexr\IlmImf\ImfOutputFile.cpp(335): error C3861:
"max": Bezeichner wurde nicht gefunden.
16>..\..\libraries\openexr\IlmImf\ImfOutputFile.cpp(336): error C3861:
"min": Bezeichner wurde nicht gefunden.
16>..\..\libraries\openexr\IlmImf\ImfOutputFile.cpp(341): error C3861:
"min": Bezeichner wurde nicht gefunden.
16>..\..\libraries\openexr\IlmImf\ImfOutputFile.cpp(342): error C3861:
"max": Bezeichner wurde nicht gefunden.
16>..\..\libraries\openexr\IlmImf\ImfOutputFile.cpp(450): error C3861:
"min": Bezeichner wurde nicht gefunden.
16>..\..\libraries\openexr\IlmImf\ImfOutputFile.cpp(456): error C3861:
"max": Bezeichner wurde nicht gefunden.
16>..\..\libraries\openexr\IlmImf\ImfOutputFile.cpp(457): error C3861:
"min": Bezeichner wurde nicht gefunden.
16>..\..\libraries\openexr\IlmImf\ImfOutputFile.cpp(955): error C3861:
"min": Bezeichner wurde nicht gefunden.
16>..\..\libraries\openexr\IlmImf\ImfOutputFile.cpp(955): error C3861:
"max": Bezeichner wurde nicht gefunden.
16>..\..\libraries\openexr\IlmImf\ImfOutputFile.cpp(978): error C3861:
"min": Bezeichner wurde nicht gefunden.
16>..\..\libraries\openexr\IlmImf\ImfOutputFile.cpp(978): error C3861:
"max": Bezeichner wurde nicht gefunden.
16>..\..\libraries\openexr\IlmImf\ImfOutputFile.cpp(1107): warning
C4018: "<": Konflikt zwischen "signed" und "unsigned"
16>  ImfOpaqueAttribute.cpp
16>H:\Program Files (x86)\Microsoft Visual Studio
14.0\VC\include\yvals.h(26): warning C4005: "_HAS_CPP0X":
Makro-Neudefinition
16>  H:\Program Files (x86)\Microsoft Visual Studio
14.0\VC\include\yvals.h(26): note: Befehlszeilenargumente: siehe
vorherige Definition von "_HAS_CPP0X"
19>  ccodemax.cpp
16>..\..\libraries\openexr\IlmImf\ImfOpaqueAttribute.cpp(54): warning
C4996: 'strcpy': This function or variable may be unsafe. Consider using
strcpy_s instead. To disable deprecation, use _CRT_SECURE_NO_WARNINGS.
See online help for details.
16>  C:\Program Files (x86)\Windows
Kits\10\Include\10.0.10240.0\ucrt\string.h(119): note: Siehe Deklaration
von "strcpy"
16>..\..\libraries\openexr\IlmImf\ImfOpaqueAttribute.cpp(63): warning
C4996: 'strcpy': This function or variable may be unsafe. Consider using
strcpy_s instead. To disable deprecation, use _CRT_SECURE_NO_WARNINGS.
See online help for details.
16>  C:\Program Files (x86)\Windows
Kits\10\Include\10.0.10240.0\ucrt\string.h(119): note: Siehe Deklaration
von "strcpy"
16>  ImfMisc.cpp
16>H:\Program Files (x86)\Microsoft Visual Studio
14.0\VC\include\yvals.h(26): warning C4005: "_HAS_CPP0X":
Makro-Neudefinition
16>  H:\Program Files (x86)\Microsoft Visual Studio
14.0\VC\include\yvals.h(26): note: Befehlszeilenargumente: siehe
vorherige Definition von "_HAS_CPP0X"
19>H:\Program Files (x86)\Microsoft Visual Studio
14.0\VC\include\yvals.h(26): warning C4005: "_HAS_CPP0X":
Makro-Neudefinition
19>  H:\Program Files (x86)\Microsoft Visual Studio
14.0\VC\include\yvals.h(26): note: Befehlszeilenargumente: siehe
vorherige Definition von "_HAS_CPP0X"
16>H:\- Setup\Applications\-
3D\POV-Ray\C++\povray-3.7-stable\libraries\openexr\IlmImf\ImfName.h(103): warning
C4996: 'strncpy': This function or variable may be unsafe. Consider
using strncpy_s instead. To disable deprecation, use
_CRT_SECURE_NO_WARNINGS. See online help for details.
16>  C:\Program Files (x86)\Windows
Kits\10\Include\10.0.10240.0\ucrt\string.h(346): note: Siehe Deklaration
von "strncpy"
16>..\..\libraries\openexr\IlmImf\ImfMisc.cpp(141): warning C4018: "<":
Konflikt zwischen "signed" und "unsigned"
16>..\..\libraries\openexr\IlmImf\ImfMisc.cpp(221): warning C4244:
"Argument": Konvertierung von "double" in "float", möglicher Datenverlust
16>..\..\libraries\openexr\IlmImf\ImfMisc.cpp(567): warning C4018: "<":
Konflikt zwischen "signed" und "unsigned"
16>..\..\libraries\openexr\IlmImf\ImfMisc.cpp(576): warning C4018: "<":
Konflikt zwischen "signed" und "unsigned"
16>..\..\libraries\openexr\IlmImf\ImfMisc.cpp(585): warning C4018: "<":
Konflikt zwischen "signed" und "unsigned"
16>..\..\libraries\openexr\IlmImf\ImfMisc.cpp(717): warning C4018: "<":
Konflikt zwischen "signed" und "unsigned"
16>..\..\libraries\openexr\IlmImf\ImfMisc.cpp(724): warning C4018: "<":
Konflikt zwischen "signed" und "unsigned"
16>..\..\libraries\openexr\IlmImf\ImfMisc.cpp(731): warning C4018: "<":
Konflikt zwischen "signed" und "unsigned"
16>..\..\libraries\openexr\IlmImf\ImfMisc.cpp(751): warning C4018: "<":
Konflikt zwischen "signed" und "unsigned"
16>..\..\libraries\openexr\IlmImf\ImfMisc.cpp(762): warning C4018: "<":
Konflikt zwischen "signed" und "unsigned"
16>..\..\libraries\openexr\IlmImf\ImfMisc.cpp(771): warning C4018: "<":
Konflikt zwischen "signed" und "unsigned"
16>  ImfMatrixAttribute.cpp
16>H:\Program Files (x86)\Microsoft Visual Studio
14.0\VC\include\yvals.h(26): warning C4005: "_HAS_CPP0X":
Makro-Neudefinition
16>  H:\Program Files (x86)\Microsoft Visual Studio
14.0\VC\include\yvals.h(26): note: Befehlszeilenargumente: siehe
vorherige Definition von "_HAS_CPP0X"
19>  Code wird generiert...
16>  ImfLut.cpp
16>H:\- Setup\Applications\-
3D\POV-Ray\C++\povray-3.7-stable\libraries\openexr\IlmImf\ImfName.h(103): warning
C4996: 'strncpy': This function or variable may be unsafe. Consider
using strncpy_s instead. To disable deprecation, use
_CRT_SECURE_NO_WARNINGS. See online help for details.
16>  C:\Program Files (x86)\Windows
Kits\10\Include\10.0.10240.0\ucrt\string.h(346): note: Siehe Deklaration
von "strncpy"
16>H:\Program Files (x86)\Microsoft Visual Studio
14.0\VC\include\yvals.h(26): warning C4005: "_HAS_CPP0X":
Makro-Neudefinition
16>  H:\Program Files (x86)\Microsoft Visual Studio
14.0\VC\include\yvals.h(26): note: Befehlszeilenargumente: siehe
vorherige Definition von "_HAS_CPP0X"
16>..\..\libraries\openexr\IlmImf\ImfLut.cpp(155): warning C4244:
"Initialisierung": Konvertierung von "double" in "float", möglicher
Datenverlust
16>..\..\libraries\openexr\IlmImf\ImfLut.cpp(155): warning C4244:
"Initialisierung": Konvertierung von "double" in "const float",
möglicher Datenverlust
16>..\..\libraries\openexr\IlmImf\ImfLut.cpp(173): warning C4244:
"Argument": Konvertierung von "double" in "float", möglicher Datenverlust
16>  ImfLineOrderAttribute.cpp
16>H:\Program Files (x86)\Microsoft Visual Studio
14.0\VC\include\yvals.h(26): warning C4005: "_HAS_CPP0X":
Makro-Neudefinition
16>  H:\Program Files (x86)\Microsoft Visual Studio
14.0\VC\include\yvals.h(26): note: Befehlszeilenargumente: siehe
vorherige Definition von "_HAS_CPP0X"
16>  ImfKeyCodeAttribute.cpp
16>H:\Program Files (x86)\Microsoft Visual Studio
14.0\VC\include\yvals.h(26): warning C4005: "_HAS_CPP0X":
Makro-Neudefinition
16>  H:\Program Files (x86)\Microsoft Visual Studio
14.0\VC\include\yvals.h(26): note: Befehlszeilenargumente: siehe
vorherige Definition von "_HAS_CPP0X"
16>  ImfKeyCode.cpp
16>H:\Program Files (x86)\Microsoft Visual Studio
14.0\VC\include\yvals.h(26): warning C4005: "_HAS_CPP0X":
Makro-Neudefinition
16>  H:\Program Files (x86)\Microsoft Visual Studio
14.0\VC\include\yvals.h(26): note: Befehlszeilenargumente: siehe
vorherige Definition von "_HAS_CPP0X"
16>  ImfIO.cpp
16>H:\Program Files (x86)\Microsoft Visual Studio
14.0\VC\include\yvals.h(26): warning C4005: "_HAS_CPP0X":
Makro-Neudefinition
16>  H:\Program Files (x86)\Microsoft Visual Studio
14.0\VC\include\yvals.h(26): note: Befehlszeilenargumente: siehe
vorherige Definition von "_HAS_CPP0X"
16>  ImfIntAttribute.cpp
16>H:\Program Files (x86)\Microsoft Visual Studio
14.0\VC\include\yvals.h(26): warning C4005: "_HAS_CPP0X":
Makro-Neudefinition
16>  H:\Program Files (x86)\Microsoft Visual Studio
14.0\VC\include\yvals.h(26): note: Befehlszeilenargumente: siehe
vorherige Definition von "_HAS_CPP0X"
16>  ImfInputFile.cpp
16>H:\- Setup\Applications\-
3D\POV-Ray\C++\povray-3.7-stable\libraries\openexr\IlmImf\ImfName.h(103): warning
C4996: 'strncpy': This function or variable may be unsafe. Consider
using strncpy_s instead. To disable deprecation, use
_CRT_SECURE_NO_WARNINGS. See online help for details.
16>  C:\Program Files (x86)\Windows
Kits\10\Include\10.0.10240.0\ucrt\string.h(346): note: Siehe Deklaration
von "strncpy"
16>H:\Program Files (x86)\Microsoft Visual Studio
14.0\VC\include\yvals.h(26): warning C4005: "_HAS_CPP0X":
Makro-Neudefinition
16>  H:\Program Files (x86)\Microsoft Visual Studio
14.0\VC\include\yvals.h(26): note: Befehlszeilenargumente: siehe
vorherige Definition von "_HAS_CPP0X"
16>..\..\libraries\openexr\IlmImf\ImfInputFile.cpp(296): warning C4018:
"<": Konflikt zwischen "signed" und "unsigned"
16>  ImfHuf.cpp
16>H:\Program Files (x86)\Microsoft Visual Studio
14.0\VC\include\yvals.h(26): warning C4005: "_HAS_CPP0X":
Makro-Neudefinition
16>  H:\Program Files (x86)\Microsoft Visual Studio
14.0\VC\include\yvals.h(26): note: Befehlszeilenargumente: siehe
vorherige Definition von "_HAS_CPP0X"
16>..\..\libraries\openexr\IlmImf\ImfHuf.cpp(168): warning C4244: "=":
Konvertierung von "Imath::Int64" in "char", möglicher Datenverlust
16>..\..\libraries\openexr\IlmImf\ImfHuf.cpp(247): warning C4244:
"Initialisierung": Konvertierung von "Imath::Int64" in "int", möglicher
Datenverlust
16>..\..\libraries\openexr\IlmImf\ImfHuf.cpp(478): warning C4244:
"Initialisierung": Konvertierung von "Imath::Int64" in "int", möglicher
Datenverlust
16>..\..\libraries\openexr\IlmImf\ImfHuf.cpp(547): warning C4244:
"Initialisierung": Konvertierung von "Imath::Int64" in "int", möglicher
Datenverlust
16>..\..\libraries\openexr\IlmImf\ImfHuf.cpp(559): warning C4244:
"Initialisierung": Konvertierung von "Imath::Int64" in "int", möglicher
Datenverlust
16>..\..\libraries\openexr\IlmImf\ImfHuf.cpp(606): warning C4244:
"Initialisierung": Konvertierung von "Imath::Int64" in "int", möglicher
Datenverlust
16>..\..\libraries\openexr\IlmImf\ImfHuf.cpp(709): warning C4244:
"Argument": Konvertierung von "Imath::Int64" in "int", möglicher
Datenverlust
16>..\..\libraries\openexr\IlmImf\ImfHuf.cpp(877): warning C4244:
"Initialisierung": Konvertierung von "Imath::Int64" in "unsigned char",
möglicher Datenverlust
16>..\..\libraries\openexr\IlmImf\ImfHuf.cpp(892): warning C4244:
"Initialisierung": Konvertierung von "Imath::Int64" in "int", möglicher
Datenverlust
16>..\..\libraries\openexr\IlmImf\ImfHuf.cpp(907): warning C4244:
"Initialisierung": Konvertierung von "Imath::Int64" in "unsigned char",
möglicher Datenverlust
16>..\..\libraries\openexr\IlmImf\ImfHuf.cpp(934): warning C4244:
"Initialisierung": Konvertierung von "Imath::Int64" in "unsigned char",
möglicher Datenverlust
16>  ImfHeader.cpp
16>H:\- Setup\Applications\-
3D\POV-Ray\C++\povray-3.7-stable\libraries\openexr\IlmImf\ImfName.h(103): warning
C4996: 'strncpy': This function or variable may be unsafe. Consider
using strncpy_s instead. To disable deprecation, use
_CRT_SECURE_NO_WARNINGS. See online help for details.
16>  C:\Program Files (x86)\Windows
Kits\10\Include\10.0.10240.0\ucrt\string.h(346): note: Siehe Deklaration
von "strncpy"
16>H:\Program Files (x86)\Microsoft Visual Studio
14.0\VC\include\yvals.h(26): warning C4005: "_HAS_CPP0X":
Makro-Neudefinition
16>  H:\Program Files (x86)\Microsoft Visual Studio
14.0\VC\include\yvals.h(26): note: Befehlszeilenargumente: siehe
vorherige Definition von "_HAS_CPP0X"
16>..\..\libraries\openexr\IlmImf\ImfHeader.cpp(582): warning C4305:
"Initialisierung": Verkürzung von "double" in "float"
16>..\..\libraries\openexr\IlmImf\ImfHeader.cpp(627): warning C4018:
"<": Konflikt zwischen "signed" und "unsigned"
16>..\..\libraries\openexr\IlmImf\ImfHeader.cpp(634): warning C4018:
"<": Konflikt zwischen "signed" und "unsigned"
16>  Code wird generiert...
16>  Kompilieren...
16>  ImfFramesPerSecond.cpp
16>  ImfFrameBuffer.cpp
16>H:\- Setup\Applications\-
3D\POV-Ray\C++\povray-3.7-stable\libraries\openexr\IlmImf\ImfName.h(103): warning
C4996: 'strncpy': This function or variable may be unsafe. Consider
using strncpy_s instead. To disable deprecation, use
_CRT_SECURE_NO_WARNINGS. See online help for details.
16>  C:\Program Files (x86)\Windows
Kits\10\Include\10.0.10240.0\ucrt\string.h(346): note: Siehe Deklaration
von "strncpy"
16>H:\Program Files (x86)\Microsoft Visual Studio
14.0\VC\include\yvals.h(26): warning C4005: "_HAS_CPP0X":
Makro-Neudefinition
16>  H:\Program Files (x86)\Microsoft Visual Studio
14.0\VC\include\yvals.h(26): note: Befehlszeilenargumente: siehe
vorherige Definition von "_HAS_CPP0X"
16>  ImfFloatAttribute.cpp
16>H:\Program Files (x86)\Microsoft Visual Studio
14.0\VC\include\yvals.h(26): warning C4005: "_HAS_CPP0X":
Makro-Neudefinition
16>  H:\Program Files (x86)\Microsoft Visual Studio
14.0\VC\include\yvals.h(26): note: Befehlszeilenargumente: siehe
vorherige Definition von "_HAS_CPP0X"
16>  ImfEnvmapAttribute.cpp
16>H:\Program Files (x86)\Microsoft Visual Studio
14.0\VC\include\yvals.h(26): warning C4005: "_HAS_CPP0X":
Makro-Neudefinition
16>  H:\Program Files (x86)\Microsoft Visual Studio
14.0\VC\include\yvals.h(26): note: Befehlszeilenargumente: siehe
vorherige Definition von "_HAS_CPP0X"
19>     Bibliothek "bin32\lib/cmedit32d.lib" und Objekt
"bin32\lib/cmedit32d.exp" werden erstellt.
16>  ImfEnvmap.cpp
16>H:\Program Files (x86)\Microsoft Visual Studio
14.0\VC\include\yvals.h(26): warning C4005: "_HAS_CPP0X":
Makro-Neudefinition
16>  H:\Program Files (x86)\Microsoft Visual Studio
14.0\VC\include\yvals.h(26): note: Befehlszeilenargumente: siehe
vorherige Definition von "_HAS_CPP0X"
16>..\..\libraries\openexr\IlmImf\ImfEnvmap.cpp(77): warning C4244: "=":
Konvertierung von "double" in "float", möglicher Datenverlust
16>..\..\libraries\openexr\IlmImf\ImfEnvmap.cpp(88): warning C4244: "=":
Konvertierung von "double" in "float", möglicher Datenverlust
16>..\..\libraries\openexr\IlmImf\ImfEnvmap.cpp(102): warning C4244:
"Initialisierung": Konvertierung von "double" in "float", möglicher
Datenverlust
16>..\..\libraries\openexr\IlmImf\ImfEnvmap.cpp(103): warning C4244:
"Initialisierung": Konvertierung von "double" in "float", möglicher
Datenverlust
16>  ImfDoubleAttribute.cpp
16>H:\Program Files (x86)\Microsoft Visual Studio
14.0\VC\include\yvals.h(26): warning C4005: "_HAS_CPP0X":
Makro-Neudefinition
16>  H:\Program Files (x86)\Microsoft Visual Studio
14.0\VC\include\yvals.h(26): note: Befehlszeilenargumente: siehe
vorherige Definition von "_HAS_CPP0X"
16>  ImfCRgbaFile.cpp
16>H:\- Setup\Applications\-
3D\POV-Ray\C++\povray-3.7-stable\libraries\openexr\IlmImf\ImfName.h(103): warning
C4996: 'strncpy': This function or variable may be unsafe. Consider
using strncpy_s instead. To disable deprecation, use
_CRT_SECURE_NO_WARNINGS. See online help for details.
16>  C:\Program Files (x86)\Windows
Kits\10\Include\10.0.10240.0\ucrt\string.h(346): note: Siehe Deklaration
von "strncpy"
16>H:\Program Files (x86)\Microsoft Visual Studio
14.0\VC\include\yvals.h(26): warning C4005: "_HAS_CPP0X":
Makro-Neudefinition
16>  H:\Program Files (x86)\Microsoft Visual Studio
14.0\VC\include\yvals.h(26): note: Befehlszeilenargumente: siehe
vorherige Definition von "_HAS_CPP0X"
16>..\..\libraries\openexr\IlmImf\ImfCRgbaFile.cpp(78): warning C4996:
'strncpy': This function or variable may be unsafe. Consider using
strncpy_s instead. To disable deprecation, use _CRT_SECURE_NO_WARNINGS.
See online help for details.
16>  C:\Program Files (x86)\Windows
Kits\10\Include\10.0.10240.0\ucrt\string.h(346): note: Siehe Deklaration
von "strncpy"
16>..\..\libraries\openexr\IlmImf\ImfCRgbaFile.cpp(292): warning C4244:
"=": Konvertierung von "const int" in "float", möglicher Datenverlust
16>..\..\libraries\openexr\IlmImf\ImfCRgbaFile.cpp(293): warning C4244:
"=": Konvertierung von "const int" in "float", möglicher Datenverlust
16>  ImfConvert.cpp
16>H:\Program Files (x86)\Microsoft Visual Studio
14.0\VC\include\yvals.h(26): warning C4005: "_HAS_CPP0X":
Makro-Neudefinition
16>  H:\Program Files (x86)\Microsoft Visual Studio
14.0\VC\include\yvals.h(26): note: Befehlszeilenargumente: siehe
vorherige Definition von "_HAS_CPP0X"
19>  cmedit.vcxproj -> H:\- Setup\Applications\-
3D\POV-Ray\C++\povray-3.7-stable\windows\vs10\bin32\cmedit32d.dll
16>..\..\libraries\openexr\IlmImf\ImfConvert.cpp(119): warning C4244:
"Argument": Konvertierung von "unsigned int" in "float", möglicher
Datenverlust
16>  ImfCompressor.cpp
16>H:\Program Files (x86)\Microsoft Visual Studio
14.0\VC\include\yvals.h(26): warning C4005: "_HAS_CPP0X":
Makro-Neudefinition
16>  H:\Program Files (x86)\Microsoft Visual Studio
14.0\VC\include\yvals.h(26): note: Befehlszeilenargumente: siehe
vorherige Definition von "_HAS_CPP0X"
16>  ImfCompressionAttribute.cpp
16>H:\Program Files (x86)\Microsoft Visual Studio
14.0\VC\include\yvals.h(26): warning C4005: "_HAS_CPP0X":
Makro-Neudefinition
16>  H:\Program Files (x86)\Microsoft Visual Studio
14.0\VC\include\yvals.h(26): note: Befehlszeilenargumente: siehe
vorherige Definition von "_HAS_CPP0X"
16>  ImfChromaticitiesAttribute.cpp
16>H:\Program Files (x86)\Microsoft Visual Studio
14.0\VC\include\yvals.h(26): warning C4005: "_HAS_CPP0X":
Makro-Neudefinition
16>  H:\Program Files (x86)\Microsoft Visual Studio
14.0\VC\include\yvals.h(26): note: Befehlszeilenargumente: siehe
vorherige Definition von "_HAS_CPP0X"
16>  ImfChromaticities.cpp
16>H:\Program Files (x86)\Microsoft Visual Studio
14.0\VC\include\yvals.h(26): warning C4005: "_HAS_CPP0X":
Makro-Neudefinition
16>  H:\Program Files (x86)\Microsoft Visual Studio
14.0\VC\include\yvals.h(26): note: Befehlszeilenargumente: siehe
vorherige Definition von "_HAS_CPP0X"
16>  ImfChannelListAttribute.cpp
16>H:\Program Files (x86)\Microsoft Visual Studio
14.0\VC\include\yvals.h(26): warning C4005: "_HAS_CPP0X":
Makro-Neudefinition
16>  H:\Program Files (x86)\Microsoft Visual Studio
14.0\VC\include\yvals.h(26): note: Befehlszeilenargumente: siehe
vorherige Definition von "_HAS_CPP0X"
16>H:\- Setup\Applications\-
3D\POV-Ray\C++\povray-3.7-stable\libraries\openexr\IlmImf\ImfName.h(103): warning
C4996: 'strncpy': This function or variable may be unsafe. Consider
using strncpy_s instead. To disable deprecation, use
_CRT_SECURE_NO_WARNINGS. See online help for details.
16>  C:\Program Files (x86)\Windows
Kits\10\Include\10.0.10240.0\ucrt\string.h(346): note: Siehe Deklaration
von "strncpy"
16>  ImfChannelList.cpp
16>H:\- Setup\Applications\-
3D\POV-Ray\C++\povray-3.7-stable\libraries\openexr\IlmImf\ImfName.h(103): warning
C4996: 'strncpy': This function or variable may be unsafe. Consider
using strncpy_s instead. To disable deprecation, use
_CRT_SECURE_NO_WARNINGS. See online help for details.
16>  C:\Program Files (x86)\Windows
Kits\10\Include\10.0.10240.0\ucrt\string.h(346): note: Siehe Deklaration
von "strncpy"
16>H:\Program Files (x86)\Microsoft Visual Studio
14.0\VC\include\yvals.h(26): warning C4005: "_HAS_CPP0X":
Makro-Neudefinition
16>  H:\Program Files (x86)\Microsoft Visual Studio
14.0\VC\include\yvals.h(26): note: Befehlszeilenargumente: siehe
vorherige Definition von "_HAS_CPP0X"
16>  ImfBoxAttribute.cpp
16>H:\Program Files (x86)\Microsoft Visual Studio
14.0\VC\include\yvals.h(26): warning C4005: "_HAS_CPP0X":
Makro-Neudefinition
16>  H:\Program Files (x86)\Microsoft Visual Studio
14.0\VC\include\yvals.h(26): note: Befehlszeilenargumente: siehe
vorherige Definition von "_HAS_CPP0X"
16>  ImfB44Compressor.cpp
16>H:\Program Files (x86)\Microsoft Visual Studio
14.0\VC\include\yvals.h(26): warning C4005: "_HAS_CPP0X":
Makro-Neudefinition
16>  H:\Program Files (x86)\Microsoft Visual Studio
14.0\VC\include\yvals.h(26): note: Befehlszeilenargumente: siehe
vorherige Definition von "_HAS_CPP0X"
16>H:\- Setup\Applications\-
3D\POV-Ray\C++\povray-3.7-stable\libraries\openexr\IlmImf\ImfName.h(103): warning
C4996: 'strncpy': This function or variable may be unsafe. Consider
using strncpy_s instead. To disable deprecation, use
_CRT_SECURE_NO_WARNINGS. See online help for details.
16>  C:\Program Files (x86)\Windows
Kits\10\Include\10.0.10240.0\ucrt\string.h(346): note: Siehe Deklaration
von "strncpy"
16>..\..\libraries\openexr\IlmImf\ImfB44Compressor.cpp(130): fatal error
C1083: Datei (Include) kann nicht geöffnet werden: "b44ExpLogTable.h":
No such file or directory
16>  ImfAttribute.cpp
16>H:\Program Files (x86)\Microsoft Visual Studio
14.0\VC\include\yvals.h(26): warning C4005: "_HAS_CPP0X":
Makro-Neudefinition
16>  H:\Program Files (x86)\Microsoft Visual Studio
14.0\VC\include\yvals.h(26): note: Befehlszeilenargumente: siehe
vorherige Definition von "_HAS_CPP0X"
16>  Code wird generiert...
20>------ Erstellen gestartet: Projekt: GUI, Konfiguration: Debug Win32
------
20>  winprecomp.cpp
20>H:\Program Files (x86)\Microsoft Visual Studio
14.0\VC\include\yvals.h(26): warning C4005: "_HAS_CPP0X":
Makro-Neudefinition
20>  H:\Program Files (x86)\Microsoft Visual Studio
14.0\VC\include\yvals.h(26): note: Befehlszeilenargumente: siehe
vorherige Definition von "_HAS_CPP0X"
20>  Unknown compiler version - please run the configure tests and
report the results
20>H:\- Setup\Applications\-
3D\POV-Ray\C++\povray-3.7-stable\libraries\boost\boost/thread/xtime.hpp(23):
error C2059: Syntaxfehler: "Konstante"
20>H:\- Setup\Applications\-
3D\POV-Ray\C++\povray-3.7-stable\libraries\boost\boost/thread/xtime.hpp(31):
error C2143: Syntaxfehler: Es fehlt ";" vor "}"
20>H:\- Setup\Applications\-
3D\POV-Ray\C++\povray-3.7-stable\libraries\boost\boost/thread/xtime.hpp(46):
error C2833: Operator "system_time" ist kein bekannter Operator oder Typ
20>H:\- Setup\Applications\-
3D\POV-Ray\C++\povray-3.7-stable\libraries\boost\boost/thread/xtime.hpp(46):
error C2059: Syntaxfehler: "newline"
20>H:\- Setup\Applications\-
3D\POV-Ray\C++\povray-3.7-stable\libraries\boost\boost/thread/xtime.hpp(47):
error C2334: Unerwartete(s) Token vor "{"; sichtbarer Funktionstext wird
übersprungen
20>H:\- Setup\Applications\-
3D\POV-Ray\C++\povray-3.7-stable\libraries\boost\boost/thread/xtime.hpp(73):
error C3861: "get_system_time": Bezeichner wurde nicht gefunden.
20>H:\- Setup\Applications\-
3D\POV-Ray\C++\povray-3.7-stable\libraries\boost\boost/thread/xtime.hpp(88):
error C2059: Syntaxfehler: "}"
20>H:\- Setup\Applications\-
3D\POV-Ray\C++\povray-3.7-stable\libraries\boost\boost/thread/xtime.hpp(88):
error C2143: Syntaxfehler: Es fehlt ";" vor "}"
20>h:\- setup\applications\-
3d\pov-ray\c++\povray-3.7-stable\libraries\boost\boost\thread\win32\basic_timed_mutex.hpp(22):
error C2143: Syntaxfehler: Es fehlt ";" vor "{"
20>h:\- setup\applications\-
3d\pov-ray\c++\povray-3.7-stable\libraries\boost\boost\thread\win32\basic_timed_mutex.hpp(22):
error C2447: "{": Funktionsheader fehlt - Parameterliste im alten Stil?
20>H:\- Setup\Applications\-
3D\POV-Ray\C++\povray-3.7-stable\libraries\boost\boost/thread/win32/mutex.hpp(19):
error C2039: "basic_timed_mutex": Ist kein Element von "boost::detail"
20>  H:\- Setup\Applications\-
3D\POV-Ray\C++\povray-3.7-stable\libraries\boost\boost/thread/win32/mutex.hpp(17):
note: Siehe Deklaration von "boost::detail"
20>H:\- Setup\Applications\-
3D\POV-Ray\C++\povray-3.7-stable\libraries\boost\boost/thread/win32/mutex.hpp(19):
error C4430: Fehlender Typspezifizierer - int wird angenommen. Hinweis:
"default-int" wird von C++ nicht unterstützt.
20>H:\- Setup\Applications\-
3D\POV-Ray\C++\povray-3.7-stable\libraries\boost\boost/thread/win32/mutex.hpp(19):
error C2146: Syntaxfehler: Fehlendes ";" vor Bezeichner "underlying_mutex"
20>H:\- Setup\Applications\-
3D\POV-Ray\C++\povray-3.7-stable\libraries\boost\boost/thread/win32/mutex.hpp(24):
error C2039: "underlying_mutex": Ist kein Element von "boost::detail"
20>  H:\- Setup\Applications\-
3D\POV-Ray\C++\povray-3.7-stable\libraries\boost\boost/thread/win32/mutex.hpp(17):
note: Siehe Deklaration von "boost::detail"
20>H:\- Setup\Applications\-
3D\POV-Ray\C++\povray-3.7-stable\libraries\boost\boost/thread/win32/mutex.hpp(24):
error C2504: "underlying_mutex": Basisklasse undefiniert
20>H:\- Setup\Applications\-
3D\POV-Ray\C++\povray-3.7-stable\libraries\boost\boost/thread/win32/mutex.hpp(31):
error C3861: "initialize": Bezeichner wurde nicht gefunden.
20>H:\- Setup\Applications\-
3D\POV-Ray\C++\povray-3.7-stable\libraries\boost\boost/thread/win32/mutex.hpp(35):
error C3861: "destroy": Bezeichner wurde nicht gefunden.
20>H:\- Setup\Applications\-
3D\POV-Ray\C++\povray-3.7-stable\libraries\boost\boost/thread/win32/mutex.hpp(46):
error C2516: "boost::detail::basic_timed_mutex": Keine zulässige Basisklasse
20>  H:\- Setup\Applications\-
3D\POV-Ray\C++\povray-3.7-stable\libraries\boost\boost/thread/win32/mutex.hpp(19):
note: Siehe Deklaration von "boost::detail::basic_timed_mutex"
20>H:\- Setup\Applications\-
3D\POV-Ray\C++\povray-3.7-stable\libraries\boost\boost/thread/win32/mutex.hpp(53):
error C3861: "initialize": Bezeichner wurde nicht gefunden.
20>H:\- Setup\Applications\-
3D\POV-Ray\C++\povray-3.7-stable\libraries\boost\boost/thread/win32/mutex.hpp(58):
error C3861: "destroy": Bezeichner wurde nicht gefunden.
20>H:\- Setup\Applications\-
3D\POV-Ray\C++\povray-3.7-stable\libraries\boost\boost/thread/detail/thread.hpp(385):
error C2440: "<function-style-cast>": "const boost::xtime" kann nicht in
"boost::system_time" konvertiert werden
20>  H:\- Setup\Applications\-
3D\POV-Ray\C++\povray-3.7-stable\libraries\boost\boost/thread/detail/thread.hpp(385):
note: Quelltyp konnte von keinem Konstruktor angenommen werden, oder die
Überladungsauflösung des Konstruktors ist mehrdeutig
20>H:\- Setup\Applications\-
3D\POV-Ray\C++\povray-3.7-stable\libraries\boost\boost/thread/win32/condition_variable.hpp(327):
error C2440: "<function-style-cast>": "const boost::xtime" kann nicht in
"boost::system_time" konvertiert werden
20>  H:\- Setup\Applications\-
3D\POV-Ray\C++\povray-3.7-stable\libraries\boost\boost/thread/win32/condition_variable.hpp(327):
note: Quelltyp konnte von keinem Konstruktor angenommen werden, oder die
Überladungsauflösung des Konstruktors ist mehrdeutig
20>H:\- Setup\Applications\-
3D\POV-Ray\C++\povray-3.7-stable\libraries\boost\boost/thread/win32/condition_variable.hpp(327):
error C2672: "boost::detail::basic_condition_variable::do_wait": keine
übereinstimmende überladene Funktion gefunden
20>H:\- Setup\Applications\-
3D\POV-Ray\C++\povray-3.7-stable\libraries\boost\boost/thread/win32/condition_variable.hpp(327):
error C2780: "bool
boost::detail::basic_condition_variable::do_wait(lock_type &,const
boost::detail::timeout &,predicate_type)": Erwartet 3 Argumente - 1
unterstützt
20>  H:\- Setup\Applications\-
3D\POV-Ray\C++\povray-3.7-stable\libraries\boost\boost/thread/win32/condition_variable.hpp(229):
note: Siehe Deklaration von
"boost::detail::basic_condition_variable::do_wait"
20>H:\- Setup\Applications\-
3D\POV-Ray\C++\povray-3.7-stable\libraries\boost\boost/thread/win32/condition_variable.hpp(327):
error C2780: "bool
boost::detail::basic_condition_variable::do_wait(lock_type
&,boost::detail::timeout)": Erwartet 2 Argumente - 1 unterstützt
20>  H:\- Setup\Applications\-
3D\POV-Ray\C++\povray-3.7-stable\libraries\boost\boost/thread/win32/condition_variable.hpp(207):
note: Siehe Deklaration von
"boost::detail::basic_condition_variable::do_wait"
========== Erstellen: 9 erfolgreich, 11 fehlerhaft, 0 aktuell, 0
übersprungen ==========


Post a reply to this message

From: clipka
Subject: Re: Blobs: Error1:NegativeValues:Holes!/Error2:AlphaValueOverwriting?
Date: 12 Jan 2016 14:05:01
Message: <web.56954e01483525e5ad6fa18f0@news.povray.org>
Sven Littkowski <jam### [at] yahoocom> wrote:
> Okay, I found it out.
>
> The cruel truth is, that the Microsoft Visual Studio Community Edition
> Setup mixes up the DLLs for the 32 and 64 bit versions. Highly
> unprofessional. After the faulty installation, one is now still required
> to go into the PROGRAMS AND FEATURES section of the Windows Control
> Panel, and REPAIR that faulty installation (something that takes several
> hours). Just after that additional step, one can start to use the MS VS
> software.
>
> I think, this information should be published on the POV-Ray website on
> those locations, where they talk about own (custom) compilations of
> POV-Ray and what programs to use for it.

Nope, I don't think so. We can't address each and every quirk of each and every
piece of 3rd party software that may or may not be involved in building POV-Ray.

It is uncommon for Windows users to build their own software, unless they are
already familiar with software development, so it is (normally) safe to assume
they know how to set up a build environment, including working around whatever
problems they encounter -- and, also of high importance, know where to get
support for their build tools in general: If your MS Visual Studio Community
2015 doesn't install as you expect, the primary source for support is, and will
always be, Microsoft. Any support from our side on that process is purely a
gesture of goodwill.

I can perfectly understand your frustration, but the level of support you ask
for is frivolous.


> By the way, is POV-Ray written in C# or C++?

It's C++.


Post a reply to this message

From: clipka
Subject: Re: Blobs: Error1:NegativeValues:Holes!/Error2:AlphaValueOverwriting?
Date: 12 Jan 2016 14:10:01
Message: <web.56954f73483525e5ad6fa18f0@news.povray.org>
Sven Littkowski <jam### [at] yahoocom> wrote:
> It seems to me, inside the entire POV-Ray Stable Zip there is no
> "build.h" file. Can you verify? I would make that change, but can't
> without that "build.h" file.

That is correct, but it was already mentioned that you shouldn't try to build
the Stable version anyway; you'll run into too many problems with adapting it to
VS 2015.

You'll need the zip package for the "master" branch, which has a
"source/base/build.h".

> Besides, after I made the changes to "blob.cpp", which file do I have to
> load (open) into the MS VS C software to compile my own version?

You have to load what is called the solution file, "windows/vs10/povray.sln".


> And how to compile - what menu commonds should I use?

Make sure in the combo boxes under the menu bar you have selected "Release" (as
opposed to "Debug" or "Release-SSE2"), and "x64" (presuming you're using a
64-bit version of Windows).

Then you'll need to select "Build Solution" from what is called the "Build" menu
(if I remember correctly off the top of my head).


Post a reply to this message

From: clipka
Subject: Re: Blobs: Error1:NegativeValues:Holes!/Error2:AlphaValueOverwriting?
Date: 12 Jan 2016 14:15:01
Message: <web.56955027483525e5ad6fa18f0@news.povray.org>
Sven Littkowski <jam### [at] yahoocom> wrote:
> I clicked on "Debug" and it debugged. During that process, many warnings
> were generated. And at the end, after an error message and the question
> if I wanted to continue to execute the last build, the file could not be
> run because something was missing.

Of course it was missing, because there was no last successful build.

Do NOT build the Stable branch; we explicitly do NOT support VS2015 for that
branch.


Post a reply to this message

From: clipka
Subject: Re: Blobs: Error1:NegativeValues:Holes!/Error2:AlphaValueOverwriting?
Date: 12 Jan 2016 15:43:02
Message: <56956556$1@news.povray.org>
Am 12.01.2016 um 18:33 schrieb Sven Littkowski:

> Please advise. Big thanks. :-)

Sven, please let us take this discussion out of povray.bugreports, and
to povray.windows instead, because it is no longer focused on bugs, but
rather the Windows build process.


Post a reply to this message

From: Sven Littkowski
Subject: Re: Blobs: Error1:NegativeValues:Holes!/Error2:AlphaValueOverwriting?
Date: 12 Jan 2016 22:49:39
Message: <5695c953$1@news.povray.org>
Yes, my (stupid) error was, despite of that you already described
everything in detail, that I downloaded and tried it with the STABLE
edition of our beloved POV-Ray. Now I downloaded the MASTER version, and
everything with VS works like a charm - so far.   :-)

(Always leaving the grammatical option open for sudden flaws and
catastrophes.)

As I am typing these lines, VS compiles the new (hopefully flawlessly)
improved Pov-Ray. Updates will follow.


Post a reply to this message

From: Sven Littkowski
Subject: Re: Blobs: Error1:NegativeValues:Holes!/Error2:AlphaValueOverwriting?
Date: 12 Jan 2016 23:23:15
Message: <5695d133$1@news.povray.org>
This time, the compilation succeeded ... but:

AVG reports a thread upon finishing:

Found Win32/DH{cQ?}
Object Name:
h:Setup\Applications\3D\POV-Ray\C++\povray-master\windows\vs10\bin64\pvengine64.exe

I am sure, this is just a false alarm, as I downloaded the ISO of the
German VS straight from their website, and as my   computer is otherwise
virus-free. Thus, I will tell AVG to ignore this "threat".

I am going to try out now the freshly baked pvengine64.exe...


Post a reply to this message

<<< Previous 10 Messages Goto Initial 10 Messages

Copyright 2003-2021 Persistence of Vision Raytracer Pty. Ltd.