POV-Ray : Newsgroups : povray.unix : installation error Server Time: 18 Jun 2019 17:37:55 GMT
  installation error (Message 1 to 2 of 2)  
From: Aga
Subject: installation error
Date: 27 Nov 2013 17:25:01
Message: <web.52962a624876b42f665e91ad0@news.povray.org>
Hello,
i have tried to install povray-3.7.0.RC7 on ubuntu. After I type the make check
command i got the error message:


.../source/base/libbase.a(png.o): In function `ReadPNGUpdateInfo':
png.cpp:(.text+0x448): undefined reference to `png_set_longjmp_fn'
.../source/base/libbase.a(png.o): In function `ReadPNGImage':
png.cpp:(.text+0x498): undefined reference to `png_set_longjmp_fn'
.../source/base/libbase.a(png.o): In function
`pov_base::Png::Write(pov_base::OStream*, pov_base::Image const*,
pov_base::Image::WriteOptions const&)':
png.cpp:(.text+0x27ef): undefined reference to `png_set_longjmp_fn'
png.cpp:(.text+0x3373): undefined reference to `png_set_longjmp_fn'
collect2: ld returned 1 exit status
make[2]: *** [povray] Error 1
make[2]: Leaving directory `/home/apolk/Programy/povray-3.7.0.RC7/unix'
make[1]: *** [all-recursive] Error 1
make[1]: Leaving directory `/home/apolk/Programy/povray-3.7.0.RC7'
make: *** [all] Error 2


I have no idea how to fix this problem. Can You give me any advise?

Thanks!

Agnieszka Polkowska-Nowakowska


Post a reply to this message

From: James Holsenback
Subject: Re: installation error
Date: 27 Nov 2013 17:37:46
Message: <52962dea@news.povray.org>
On 11/27/2013 12:22 PM, Aga wrote:
> Hello,
> i have tried to install povray-3.7.0.RC7 on ubuntu. After I type the make check
> command i got the error message:
>
>
> .../source/base/libbase.a(png.o): In function `ReadPNGUpdateInfo':
> png.cpp:(.text+0x448): undefined reference to `png_set_longjmp_fn'
> .../source/base/libbase.a(png.o): In function `ReadPNGImage':
> png.cpp:(.text+0x498): undefined reference to `png_set_longjmp_fn'
> .../source/base/libbase.a(png.o): In function
> `pov_base::Png::Write(pov_base::OStream*, pov_base::Image const*,
> pov_base::Image::WriteOptions const&)':
> png.cpp:(.text+0x27ef): undefined reference to `png_set_longjmp_fn'
> png.cpp:(.text+0x3373): undefined reference to `png_set_longjmp_fn'
> collect2: ld returned 1 exit status
> make[2]: *** [povray] Error 1
> make[2]: Leaving directory `/home/apolk/Programy/povray-3.7.0.RC7/unix'
> make[1]: *** [all-recursive] Error 1
> make[1]: Leaving directory `/home/apolk/Programy/povray-3.7.0.RC7'
> make: *** [all] Error 2
>
>
> I have no idea how to fix this problem. Can You give me any advise?
>
> Thanks!
>
> Agnieszka Polkowska-Nowakowska
>
>
>
why RC7 ... official version has been released 
http://www.povray.org/download/


Post a reply to this message

Copyright 2003-2008 Persistence of Vision Raytracer Pty. Ltd.